program: TURBOMOLE
programVersion: 7.7.1
title: ChemShell job
elementType: c
elementType: n
elementType: o
elementType: h
elementType: co
elementType: s
elementType: f
method: uhf
method: dft
functional: b3-lyp
elementType: c n o h co s f
basis: def2-TZVP def2-TZVP def2-TZVP def2-TZVP def2-TZVP def2-TZVP def2-TZVP
energy: -5368.985348893 hartree
formula: C63H55CoF3N6O7S
InChI: InChI=1/C51H45F3N5O4S.C11H8O.CH2NO2.Co/c1-5-59-43(42-26-24-33-16-12-14-22-40(33)45(42)46-41-23-15-13-17-34(41)25-27-44(46)60)32-58(57-59)31-38-29-39(50(2,3)4)28-37(49(38)61)30-55-47(35-18-8-6-9-19-35)48(36-20-10-7-11-21-36)56-64(62,63)51(52,53)54;12-8-9-5-6-10-3-1-2-4-11(10)7-9;1-2(3)4;/h6-30,32,47-48,60H,5,31H2,1-4H3;1-8H;1H2;/q-3;-1;;+4/rC62H53CoF3N5O5S.CH2NO2/c1-5-70-54(53-32-30-43-19-14-16-26-51(43)56(53)57-52-27-17-15-20-44(52)31-33-55(57)72)39-68(67-70)37-48-35-50(61(2,3)4)36-49-38-69-58(45-21-8-6-9-22-45)59(46-23-10-7-11-24-46)71(77(73,74)62(64,65)66)63(69,76-60(48)49)75-40-41-28-29-42-18-12-13-25-47(42)34-41;1-2(3)4/h6-36,38-40,58-59,72H,5,37H2,1-4H3;1H2
136 atoms
C  -3.18934564 -4.09508553 3.13705264
C  -1.83400379 -3.96256055 3.10017565
C  -1.16371187 -3.90902956 1.86112779
C  0.28869597 -3.69323758 1.8284228
N  1.21799886 -4.65707447 1.61333882
C  1.01581288 -6.09897931 1.54132383
C  0.9405009 -6.72301724 2.92157767
N  2.42128173 -4.17993253 1.53851783
N  2.28909674 -2.90309967 1.70710081
C  1.01074489 -2.53193571 1.90111978
C  -1.85124979 -3.97447155 0.66748492
C  -1.10431888 -3.91701356 -0.61473093
C  -0.57748893 -2.71920669 -1.06072388
O  -0.74533991 -1.54695782 -0.45778895
C  0.22437898 -2.6829677 -2.22962575
C  0.46297195 -3.81613357 -2.93830466
C  -0.08839099 -5.05798143 -2.54203471
C  -0.8907289 -5.10486942 -1.37371084
C  -1.44923584 -6.35254728 -1.00437889
C  -1.20937986 -7.48163615 -1.7422348
C  -0.39929096 -7.43170316 -2.88948067
C  0.14501098 -6.23780629 -3.27722163
C  -3.26829763 -4.08855054 0.69480192
C  -3.93944855 -4.15772053 1.94269778
C  -5.34713939 -4.27452552 1.96260978
C  -6.05974631 -4.31483751 0.79805891
C  -5.39526939 -4.23699052 -0.44124295
C  -4.03398554 -4.12618953 -0.49317595
H  -3.70677458 -4.13310953 4.08734254
H  -1.26572986 -3.87768956 4.01713254
H  0.10545599 -6.27113029 0.97326489
H  1.84367879 -6.49778126 0.95951089
H  1.84987779 -6.54067926 3.49273961
H  0.08984299 -6.34163228 3.4853726
H  0.81587891 -7.80021912 2.82224968
H  0.70588292 -1.50550383 2.03666977
H  0.65116893 -1.7340588 -2.52693572
H  1.08434888 -3.77457457 -3.82462757
H  -2.09058676 -6.41481427 -0.13398599
H  -1.65608281 -8.42062605 -1.44192484
H  -0.21683497 -8.32973606 -3.46393161
H  0.76484791 -6.1824333 -4.16423453
H  -5.85509134 -4.32512251 2.91775967
H  -7.13779019 -4.4017495 0.82405591
H  -5.96852632 -4.26293851 -1.35816084
H  -3.5293406 -4.06173554 -1.44779084
C  3.44304761 -2.02415777 1.46611984
C  3.46602561 -1.58531382 0.036734
C  2.69774069 -0.44372695 -0.32226896
O  1.99472777 0.14383498 0.57310794
Co 0.60862093 1.56306782 0.44255895
N  1.27953986 3.4912136 0.56928393
S  0.79892191 4.4016015 1.7632638
C  2.30253574 4.72199347 2.78238268
F  3.18753264 5.43456439 2.09437976
F  1.98128677 5.39451739 3.88115556
F  2.87252167 3.57566159 3.14279664
O  0.36709196 5.73682035 1.37432785
O  -0.03342399 3.60187959 2.6498337
C  1.82174679 4.09747253 -0.63211993
C  1.23829986 3.32261862 -1.84685979
N  1.42271884 1.93256378 -1.49500983
C  2.29678374 1.24806386 -2.11509876
C  2.82072868 -0.024724 -1.67461581
C  3.58612159 -0.76389991 -2.58208271
C  4.25456352 -1.92594178 -2.24455474
C  5.06662343 -2.75761969 -3.22935963
C  6.54418526 -2.74624969 -2.81595768
C  4.55116148 -4.20293352 -3.22993163
C  4.96390744 -2.21674675 -4.65520247
C  4.18576953 -2.29765574 -0.8983689
H  1.52960983 5.14769442 -0.72286992
H  1.85215779 3.57733459 -2.72332369
H  2.75238269 1.65739981 -3.02328566
H  3.64856758 -0.38195496 -3.59467559
H  6.94095921 -1.7302928 -2.81091568
H  6.69130024 -3.16106964 -1.8176218
H  7.14603919 -3.34005362 -3.5075326
H  3.4985486 -4.24462952 -3.5137076
H  5.11650842 -4.81486645 -3.93617055
H  4.64093347 -4.67249747 -2.24952574
H  3.93250355 -2.20242475 -5.01302243
H  5.36654339 -1.20615186 -4.74131446
H  5.53583537 -2.84941168 -5.3356244
H  4.72644946 -3.17713764 -0.56158794
C  -0.20368897 3.62009059 -2.20714175
C  -0.8525459 4.79036546 -1.83721379
C  -0.8850689 2.71242169 -3.01491166
C  -2.15080276 5.04328543 -2.26002474
C  -2.18119875 2.96012166 -3.43132061
C  -2.82340268 4.13050953 -3.05242365
H  -0.37717796 5.51223937 -1.18786786
H  -0.40638495 1.7857098 -3.30546563
H  -2.6437747 5.95265432 -1.94403478
H  -2.6941317 2.23350375 -4.04839754
H  -3.84230056 4.32374051 -3.36092162
C  3.33418162 4.04833154 -0.71917992
C  3.98991055 4.97282843 -1.52708883
C  4.08927654 3.07678265 -0.07371899
C  5.36452639 4.92808644 -1.69590181
C  5.46524738 3.02591466 -0.24432297
C  6.10857531 3.94799755 -1.05510488
H  3.41559161 5.74617735 -2.02606177
H  3.60485859 2.35781673 0.57156894
H  5.85522533 5.66277436 -2.32120574
H  6.03653431 2.25973274 0.26361797
H  7.18263318 3.90890956 -1.18152387
H  3.34812862 -1.18273387 2.14952276
H  4.32575451 -2.6019437 1.73355381
H  -5.84793034 6.93361721 0.63803293
C  -6.1711963 5.94732333 0.32764296
C  -7.46305116 5.73841335 -0.06981299
C  -7.88363011 4.45602749 -0.47388695
C  -7.0024152 3.41066261 -0.47018595
C  -5.66171736 3.59700559 -0.06555899
C  -5.23757441 4.88804445 0.33895096
C  -3.89148256 5.07033242 0.73466892
C  -3.00361366 4.03732654 0.70941892
C  -3.42459861 2.74834669 0.31425496
C  -4.72652947 2.53953171 -0.05352799
H  -8.16816007 6.55918925 -0.07618899
H  -8.90753099 4.30222551 -0.78783591
H  -7.32362317 2.42370472 -0.78111591
H  -5.04989043 1.55047082 -0.36242396
H  -1.97691678 4.20033552 0.99813989
H  -3.5616276 6.05326231 1.04884688
C  -2.46397072 1.61402282 0.24515397
O  -1.27249886 1.81637479 -0.09938299
H  -2.94131367 0.66066793 -0.041798
C  -2.45310272 1.16422087 2.23348775
H  -3.45820861 0.83267591 2.44704372
H  -1.26274885 -1.57475682 0.37294396
H  -2.09818476 2.09166876 2.6591897
N  -1.53221383 0.17603898 2.15805376
O  -1.88656478 -1.00365388 1.97211878
O  -0.31488896 0.47137095 2.12472476
empdispcorrection: -0.412234067 hartree
energy: -5368.9853488925355
energyOcCorr: -5368.9850987270
s2: 3.75876813
charge: -0.000000
dipole: 3.045236 -3.018526 0.026710 132.366991 -140.547969 -8.180978 -76.031829 75.195950 -0.835879
quadrupole: 23864.975323 -24185.998141 -321.022818 33255.061941 -33595.110603 -340.048662 8488.968476 -8841.208545 -352.240070 -1088.132566 1074.429703 -13.702863 -2716.611233 2709.271505 -7.339728 1499.407766 -1533.780807 -34.373041
