program: TURBOMOLE
programVersion: 7.7.1
title: ChemShell job
elementType: h
basis: def2-mSVP
elementType: c
elementType: o
method: uhf
method: dft
functional: pbeh-3c
elementType: h c o
basis: def2-mSVP def2-mSVP def2-mSVP
frequency: -0.00 -0.00 -0.00 0.0000 0.0000 0.0000 82.91 165.97 187.96 198.81 308.59 363.23 403.85 413.82 503.18 531.83 535.71 630.60 657.88 667.48 790.25 794.82 816.34 817.76 876.37 917.45 920.25 964.08 1001.32 1019.17 1046.59 1054.48 1081.25 1086.35 1183.02 1207.63 1215.11 1234.16 1287.47 1326.67 1331.77 1424.13 1459.01 1466.20 1494.24 1530.86 1559.43 1614.56 1697.23 1721.02 1757.35 1897.92 2983.64 3241.94 3260.55 3263.42 3265.33 3278.72 3290.78 3292.56
irintensity: 0.00000 0.00000 0.00000 0 0 0 1.51489 4.96230 6.57011 7.13875 4.33290 3.26557 6.81935 0.00330 22.22578 0.13510 0.07189 6.56417 1.65382 1.13096 36.33281 37.86072 11.89083 0.34558 44.28859 27.79528 5.43454 8.80687 0.85555 5.07992 0.65171 0.06981 3.42081 0.25011 23.62996 0.53923 9.07844 43.46303 13.48224 19.50890 20.52631 25.84222 7.66180 0.86814 2.87047 3.76449 17.84958 0.84225 3.06249 10.09303 25.46601 367.12522 104.25213 4.23287 1.78736 1.86939 2.45912 12.15490 11.09657 2.62065
energy: -498.1167710795 hartree
zeropoint: 0.16061701166 hartree
formula: C11H8O
InChI: InChI=1/C11H8O/c12-8-9-5-6-10-3-1-2-4-11(10)7-9/h1-8H
20 atoms
H  -4.82054754 -1.12314665 -3.28332217
C  -4.82054754 -0.64057388 -2.31374227
C  -4.82054754 0.72384429 -2.22212654
C  -4.82054754 1.35473409 -0.96279819
C  -4.82054754 0.60626607 0.1809404
C  -4.82054754 -0.80525575 0.11718085
C  -4.82054754 -1.439908 -1.1512142
C  -4.82054754 -2.85508493 -1.21550775
C  -4.82054754 -3.60837368 -0.08150862
C  -4.82054754 -2.9792241 1.1854169
C  -4.82054754 -1.6113014 1.27535876
H  -4.82054754 1.32622802 -3.12089217
H  -4.82054754 2.43496638 -0.90560405
H  -4.82054754 1.08896694 1.15062014
H  -4.82054754 -1.13391706 2.25018445
H  -4.82054754 -4.68900409 -0.13129888
H  -4.82054754 -3.3333613 -2.1872771
C  -4.82054754 -3.78170247 2.42035222
O  -4.82054754 -4.98371297 2.45466273
H  -4.82054754 -3.18191613 3.35265997
nucrepener: 608.169114018 hartree
empdispcorrection: 0.016187692 hartree
orbitalenergy: -10.5910 -9.4833 -8.6482 -8.1393 -7.3969 -1.4171 -0.5994 0.9284 1.4416 3.7234 electronvolt
s2: -0.00000000
charge: -0.000000
dipole: -746.980497 746.980497 -0.000000 -262.105810 263.470194 1.364384 0.295707 -0.892933 -0.597226
quadrupole: 6804.632467 -6859.546979 -54.914512 2036.107162 -2098.449064 -62.341902 820.474168 -866.021224 -45.547056 2387.657659 -2400.086544 -12.428885 -2.693749 8.134193 5.440444 -603.439681 611.420279 7.980598
temp: 300.00 k
press: 1.013 bar
thermalcorrgfe: 0.12633782965999998 hartree
thermalcorrener: 0.16937724705999999 hartree
entropy: 0.38496 kJ.mol-1.K-1
thermalcorrenthalpy: 0.170325637762 hartree
