program: TURBOMOLE
programVersion: 7.7.1
title: ChemShell job
elementType: c
basis: def2-mSVP
elementType: n
elementType: o
elementType: h
elementType: co
elementType: s
elementType: f
method: uhf
method: dft
functional: pbeh-3c
elementType: c n o h co s f
basis: def2-mSVP def2-mSVP def2-mSVP def2-mSVP def2-mSVP def2-mSVP def2-mSVP
energy: -4862.305063073 hartree
zeropoint: 0.9282040725999999 hartree
formula: C52H47CoF3N6O6S
InChI: InChI=1/C51H44F3N5O4S.CH3NO2.Co/c1-5-59-43(42-26-24-33-16-12-14-22-40(33)45(42)46-41-23-15-13-17-34(41)25-27-44(46)60)32-58(57-59)31-38-29-39(50(2,3)4)28-37(49(38)61)30-55-47(35-18-8-6-9-19-35)48(36-20-10-7-11-21-36)56-64(62,63)51(52,53)54;1-2(3)4;/h6-30,32,47-48H,5,31H2,1-4H3;1H3;/q-4;;+4/rC51H44CoF3N5O4S.CH3NO2/c1-5-59-43-32-57(56-59)30-37-28-39(50(2,3)4)29-38-31-58-47(35-18-8-6-9-19-35)48(36-20-10-7-11-21-36)60(65(61,62)51(53,54)55)52(58,64-49(37)38)63-44-27-25-34-17-13-15-23-41(34)46(44)45-40-22-14-12-16-33(40)24-26-42(43)45;1-2(3)4/h6-29,31-32,47-48H,5,30H2,1-4H3;1H3
116 atoms
C  1.17648876 -5.40058479 -1.82876869
C  0.23475697 -4.48643719 -2.19180135
C  -0.38588585 -3.66687208 -1.21930746
C  -1.29590895 -2.6349411 -1.721565
N  -2.6318581 -2.51974802 -1.52392102
C  -3.5148809 -3.39124852 -0.75096591
C  -4.30033841 -2.6201644 0.28926067
N  -3.14354114 -1.50054993 -2.14369836
N  -2.14739576 -0.9426804 -2.75576539
C  -0.98843199 -1.58091722 -2.53890981
C  -0.06933319 -3.77227707 0.11935859
C  -0.77702331 -2.98714916 1.15472867
C  -0.58630233 -1.60334442 1.23510686
O  0.15413708 -0.97377209 0.37910026
C  -1.23880206 -0.9083925 2.30454514
C  -2.01947347 -1.55165522 3.20967394
C  -2.24922035 -2.94541847 3.12751204
C  -1.61460502 -3.66870569 2.08449627
C  -1.88274208 -5.05893323 2.00183267
C  -2.72049429 -5.67780896 2.89192637
C  -3.33894802 -4.95341004 3.92486425
C  -3.09925165 -3.60993219 4.03264084
C  0.96077319 -4.68593517 0.49815064
C  1.57477962 -5.51173637 -0.47865914
C  2.59131301 -6.41212897 -0.08841999
C  2.99632046 -6.48384696 1.21400566
C  2.40517663 -5.65048396 2.18245325
C  1.41367944 -4.77634846 1.83545659
H  1.63861151 -6.03408672 -2.57463561
H  -0.04997959 -4.3836461 -3.23073303
H  -4.17129163 -3.89891386 -1.45839954
H  -2.87973987 -4.14042813 -0.28739317
H  -4.82960945 -3.32689822 0.92625879
H  -3.63860349 -2.03381827 0.9235299
H  -5.02819893 -1.95392818 -0.17031288
H  -0.0411758 -1.26118716 -2.93579867
H  -1.08643378 0.15785378 2.40869123
H  -2.48161332 -0.98707689 4.01109965
H  -1.41751554 -5.65067896 1.22399906
H  -2.90258087 -6.74083404 2.79882098
H  -3.99400655 -5.45421398 4.62490667
H  -3.5684129 -3.03311586 4.82134025
H  3.05211295 -7.037956 -0.84271581
H  3.77935637 -7.17247519 1.50263083
H  2.74445249 -5.69760875 3.20847434
H  0.97608849 -4.13075863 2.58363231
C  -2.35269903 0.29984247 -3.5100565
C  -2.71170139 1.43663474 -2.6090359
C  -1.7758511 1.7852982 -1.60757252
O  -0.64844702 1.16169627 -1.57178252
Co 0.42191655 0.8932772 0.0317463
N  2.06996317 1.92475828 0.51971254
S  3.5167945 1.28491165 0.44610395
C  4.31809141 2.01155237 -1.04932128
F  5.47710888 1.40579184 -1.27997576
F  3.537272 1.83929159 -2.11405966
F  4.53955648 3.30819963 -0.8891645
O  4.3895223 1.67882341 1.53926492
O  3.36913192 -0.11453339 0.08558119
C  1.86742669 3.18559454 1.21734746
C  0.47352834 3.12095624 1.89417758
N  -0.42068855 2.55451341 0.9039875
C  -1.35021935 3.25555153 0.38422516
C  -2.16876976 2.83093168 -0.72593232
C  -3.36967012 3.5122371 -0.93985539
C  -4.26944732 3.18325694 -1.93840388
C  -5.56615767 3.96837545 -2.10468676
C  -6.41573037 3.43538571 -3.25854243
C  -6.39668208 3.87419856 -0.81814881
C  -5.23710371 5.43881448 -2.39406293
C  -3.91010796 2.10704366 -2.75287769
H  2.6120518 3.32581712 2.00849327
H  0.17276588 4.14855043 2.13675316
H  -1.55972752 4.25025792 0.78894811
H  -3.60041129 4.33154781 -0.26593577
H  -6.71505534 2.39712743 -3.10303395
H  -7.32978757 4.02406574 -3.34753162
H  -5.89558883 3.5015563 -4.21596882
H  -5.86687464 4.28457431 0.04240169
H  -7.33051377 4.4309872 -0.9202209
H  -6.64654285 2.83789488 -0.58647684
H  -4.66413947 5.89638103 -1.58659922
H  -4.65088887 5.53731357 -3.30858652
H  -6.1518606 6.02271612 -2.51586902
H  -4.58250098 1.777436 -3.5357691
C  0.38293006 2.29954654 3.16419104
C  1.38051974 1.44609024 3.61885529
C  -0.79704141 2.40043243 3.90021296
C  1.19184696 0.70251842 4.77697576
C  -0.98380359 1.66362501 5.05696143
C  0.0133791 0.80315971 5.49595588
H  2.31471304 1.34386795 3.08686565
H  -1.58402312 3.06514425 3.5613578
H  1.97625098 0.03653309 5.11051892
H  -1.90539348 1.7614725 5.61620746
H  -0.12814739 0.21780047 6.39483928
C  1.90547198 4.4074792 0.32239476
C  2.32875924 5.61892326 0.8605132
C  1.46961873 4.3812278 -0.99828289
C  2.31431984 6.78084803 0.10513119
C  1.45118954 5.54360237 -1.7555865
C  1.87136939 6.74636184 -1.20877886
H  2.6873245 5.65109446 1.88346759
H  1.15295327 3.45217181 -1.45256224
H  2.6581376 7.71043483 0.53972564
H  1.11159928 5.50479307 -2.78244228
H  1.86196299 7.64947673 -1.80487779
H  -1.41843424 0.47418295 -4.04336844
H  -3.13289455 0.10936749 -4.24622552
C  3.06764615 -2.46267872 -1.8147327
H  2.13780376 -2.22904095 -1.30421095
H  3.60484379 -3.25525573 -1.30661655
H  3.67541118 -1.56238922 -1.85907799
N  2.78297968 -2.87887167 -3.20427473
O  1.93693498 -2.25508455 -3.80931897
O  3.41915541 -3.78682277 -3.67117768
empdispcorrection: 0.104135678 hartree
orbitalenergy: -7.6065 -7.1908 -7.0749 -6.7021 -6.0983 -1.1425 -1.0713 -0.9529 -0.5249 -0.3954 electronvolt
orbitalenergy: -7.5943 -7.1863 -7.0700 -6.7796 -6.0942 -1.1424 -1.0744 -0.9533 -0.5248 -0.3935 electronvolt
s2: 3.75687530
charge: -0.000000
dipole: -84.855100 80.558734 -4.296367 -3.503630 3.202572 -0.301058 -4.268303 3.911070 -0.357233
quadrupole: 15230.980085 -15536.817293 -305.837208 22058.300467 -22337.483662 -279.183195 9526.044243 -9819.241874 -293.197631 -596.386046 589.374106 -7.011940 605.376395 -595.799159 9.577236 -1805.437979 1803.909166 -1.528813
temp: 318.15 k
press: 1.013 bar
thermalcorrgfe: 0.820559823524 hartree
thermalcorrener: 0.9955702828259999 hartree
entropy: 1.45257 kJ.mol-1.K-1
thermalcorrenthalpy: 0.996579614296 hartree
