program: TURBOMOLE
programVersion: 7.7.1
title: ChemShell job
elementType: c
basis: def2-mSVP
elementType: n
elementType: o
elementType: h
elementType: co
elementType: s
elementType: f
method: uhf
method: dft
functional: pbeh-3c
elementType: c n o h co s f
basis: def2-mSVP def2-mSVP def2-mSVP def2-mSVP def2-mSVP def2-mSVP def2-mSVP
energy: -5360.399816974 hartree
zeropoint: 1.0896971078 hartree
formula: C63H55CoF3N6O7S
InChI: InChI=1/C51H45F3N5O4S.C11H8O.CH2NO2.Co/c1-5-59-43(42-26-24-33-16-12-14-22-40(33)45(42)46-41-23-15-13-17-34(41)25-27-44(46)60)32-58(57-59)31-38-29-39(50(2,3)4)28-37(49(38)61)30-55-47(35-18-8-6-9-19-35)48(36-20-10-7-11-21-36)56-64(62,63)51(52,53)54;12-8-9-5-6-10-3-1-2-4-11(10)7-9;1-2(3)4;/h6-30,32,47-48,60H,5,31H2,1-4H3;1-8H;1H2;/q-3;2*-1;+5/rC63H55CoF3N6O7S/c1-6-72-55(54-33-31-44-20-15-17-27-52(44)57(54)58-53-28-18-16-21-45(53)32-34-56(58)74)40-70(68-72)38-49-36-51(62(2,3)4)37-50-39-71-59(46-22-9-7-10-23-46)60(47-24-11-8-12-25-47)73(81(76,77)63(65,66)67)64(71,79-61(49)50,80-69(5)75)78-41-42-29-30-43-19-13-14-26-48(43)35-42/h7-37,39-41,59-60,74H,5-6,38H2,1-4H3
136 atoms
C  -4.06450934 -1.51250073 3.91429506
C  -2.88783397 -2.17315045 3.72990807
C  -2.47678602 -2.55317911 2.43361782
C  -1.12952157 -3.12029755 2.29118544
N  -0.76879442 -4.31673281 1.7638851
C  -1.62573172 -5.43270928 1.37072394
C  -1.20958086 -6.03555252 0.0457305
N  0.51928464 -4.46500619 1.70361131
N  1.00803879 -3.36982272 2.19512615
C  0.061588 -2.50748732 2.58807551
C  -3.24725263 -2.24444805 1.32699915
C  -2.81369138 -2.6371368 -0.03533199
C  -1.68726071 -2.06230237 -0.58881173
O  -0.94835549 -1.13293917 0.0109335
C  -1.23163746 -2.46754182 -1.86969219
C  -1.93412768 -3.37556612 -2.59857321
C  -3.11466475 -3.96430935 -2.08709076
C  -3.54878679 -3.60302499 -0.78572071
C  -4.69637537 -4.25029962 -0.26834747
C  -5.36985089 -5.18849501 -1.00378089
C  -4.94210624 -5.53275197 -2.29814974
C  -3.83395546 -4.92840894 -2.82376248
C  -4.44438879 -1.49339023 1.50287883
C  -4.86275745 -1.14042967 2.81152248
C  -6.04097762 -0.37890056 2.97925786
C  -6.75754224 0.04381209 1.89619979
C  -6.32748368 -0.27732857 0.59444633
C  -5.20549641 -1.03244208 0.40285555
H  -4.3733848 -1.22566796 4.91133284
H  -2.25197104 -2.39928963 4.57407558
H  -1.58845912 -6.1697829 2.17401805
H  -2.6395114 -5.04541623 1.32743925
H  -0.24608217 -6.53618636 0.11455569
H  -1.95703248 -6.76667633 -0.25765567
H  -1.15107287 -5.2761148 -0.73056092
H  0.25310327 -1.54229453 3.05112095
H  -0.31203156 -2.03835487 -2.24750284
H  -1.58136132 -3.67016218 -3.57963209
H  -5.05186683 -3.99785525 0.72189422
H  -6.24486759 -5.66717696 -0.58401343
H  -5.48638598 -6.27238699 -2.86954478
H  -3.4871944 -5.18980851 -3.81642377
H  -6.35500228 -0.11717529 3.98204735
H  -7.64975753 0.63978253 2.03448687
H  -6.87964832 0.08636849 -0.26178737
H  -4.88276745 -1.26028186 -0.60310293
C  2.46034902 -3.14357865 2.19019395
C  2.99043196 -2.85420357 0.82352711
C  2.80792818 -1.54511563 0.28856957
O  2.13349746 -0.68248582 0.9452492
Co 1.49307843 1.16895067 0.51405514
N  2.29195044 3.06727065 0.41556185
S  1.56309392 4.32931061 1.03873128
C  2.35712823 4.56251748 2.6871579
F  3.64089939 4.87182785 2.52510441
F  1.7652102 5.55249507 3.34662942
F  2.28206594 3.46089701 3.42000741
O  1.88005658 5.57577037 0.34828306
O  0.17830268 4.02683994 1.34832165
C  3.34549742 3.26605793 -0.55768664
C  3.05903365 2.32054954 -1.7489302
N  2.81380058 1.02012259 -1.16138557
C  3.5066806 0.0192564 -1.53329453
C  3.45687841 -1.29885765 -0.95276309
C  4.16039383 -2.31679104 -1.60772052
C  4.27018502 -3.60182459 -1.11619317
C  5.00902883 -4.72721287 -1.82884889
C  4.03757254 -5.88349933 -2.10043266
C  5.59297766 -4.27181101 -3.16582754
C  6.1626911 -5.22752991 -0.94987139
C  3.67388778 -3.82842097 0.12994018
H  3.36087362 4.29296931 -0.93638279
H  3.95602635 2.28811354 -2.38326883
H  4.23173572 0.14614318 -2.34516183
H  4.63987537 -2.05673637 -2.54461521
H  4.54602129 -6.70668934 -2.60725311
H  3.61003139 -6.28263979 -1.17942867
H  3.20987134 -5.55867037 -2.73265339
H  6.32415358 -3.471227 -3.04149196
H  6.10507231 -5.10410412 -3.65104609
H  4.81947986 -3.92249705 -3.85220626
H  6.87108742 -4.4251256 -0.74028032
H  5.81101424 -5.61347076 0.0079193
H  6.70520464 -6.03557052 -1.44557173
H  3.76171058 -4.80873436 0.58819763
C  1.88615159 2.6948178 -2.6398612
C  1.14338737 3.86098996 -2.50214112
C  1.53330383 1.8036507 -3.65185899
C  0.05355809 4.10547683 -3.32794082
C  0.44857355 2.04609897 -4.47861869
C  -0.30941246 3.19714464 -4.30800961
H  1.38562974 4.59530058 -1.7489497
H  2.10287966 0.8921917 -3.79093977
H  -0.52161854 5.01114043 -3.18786704
H  0.19399178 1.33652945 -5.2559353
H  -1.16890777 3.38533502 -4.93783954
C  4.73749246 2.96218976 -0.0350031
C  5.83676384 3.41960631 -0.75733352
C  4.96466004 2.20803795 1.10833448
C  7.13027999 3.12389615 -0.35945406
C  6.25906079 1.90721078 1.50914823
C  7.34591157 2.35894553 0.77791011
H  5.67775415 4.02938905 -1.64061071
H  4.13328203 1.86837629 1.7096922
H  7.96950019 3.4988353 -0.93112769
H  6.41574797 1.32019625 2.40482133
H  8.35378325 2.12694726 1.09663347
H  2.6277477 -2.30957374 2.87007428
H  2.91845627 -4.03584044 2.6146704
H  -6.62499495 3.74811077 -1.13193667
C  -6.32328888 2.85937748 -1.67218401
C  -7.24926268 2.12089576 -2.35741243
C  -6.86194332 0.96148789 -3.05877946
C  -5.55220967 0.56890984 -3.06439855
C  -4.57426178 1.31617895 -2.37028003
C  -4.96435454 2.47849962 -1.65679081
C  -3.98478155 3.21897934 -0.94896319
C  -2.6811823 2.82517238 -0.93066809
C  -2.29507084 1.66326051 -1.64303302
C  -3.21673744 0.93698839 -2.35328663
H  -8.28736176 2.42606832 -2.36311873
H  -7.60476844 0.38544056 -3.59420069
H  -5.2492802 -0.32163777 -3.60209859
H  -2.90820987 0.0458576 -2.89085867
H  -1.93482058 3.38642472 -0.38044526
H  -4.28841382 4.10740763 -0.40959835
C  -0.9247094 1.16571557 -1.56467032
O  -0.12664909 1.58967662 -0.75879541
H  -0.65542842 0.36522836 -2.26809134
C  -1.66532811 0.8784911 2.07909187
H  -1.70110431 1.65975231 1.33977875
H  -1.38623614 -0.64854523 0.75566081
H  -2.55881581 0.57399643 2.5993586
N  -0.52190184 0.72034492 2.73618299
O  -0.45658255 0.05272669 3.78508867
O  0.56462954 1.21269636 2.28712754
empdispcorrection: 0.120080356 hartree
orbitalenergy: -7.2255 -7.1585 -7.0742 -6.3483 -6.2696 -1.6669 -1.4557 -1.2077 -1.0615 -0.7009 electronvolt
orbitalenergy: -7.2346 -7.2150 -7.0434 -6.3404 -6.2579 -1.6603 -1.4556 -1.2079 -1.0612 -0.7035 electronvolt
s2: 3.75593964
charge: -0.000000
dipole: -26.291928 22.793354 -3.498573 -119.106371 112.721871 -6.384500 -28.269770 26.090776 -2.178993
quadrupole: 29230.331922 -29543.142459 -312.810537 22189.950545 -22542.444394 -352.493849 9451.169459 -9795.040113 -343.870654 3716.763318 -3729.956604 -13.193286 563.137358 -567.772749 -4.635390 724.036089 -740.657400 -16.621310
temp: 300.00 k
press: 1.013 bar
thermalcorrgfe: 0.9784916325940001 hartree
thermalcorrener: 1.160487427428 hartree
entropy: 1.60107 kJ.mol-1.K-1
thermalcorrenthalpy: 1.16143581813 hartree
