program: TURBOMOLE
programVersion: 7.7.1
title: ChemShell job
elementType: c
basis: def2-mSVP
elementType: n
elementType: o
elementType: h
elementType: co
elementType: s
elementType: f
method: uhf
method: dft
functional: pbeh-3c
elementType: c n o h co s f
basis: def2-mSVP def2-mSVP def2-mSVP def2-mSVP def2-mSVP def2-mSVP def2-mSVP
energy: -4862.286827555 hartree
zeropoint: 0.9270614332 hartree
formula: C52H47CoF3N6O6S
InChI: InChI=1/C51H45F3N5O4S.CH2NO2.Co/c1-5-59-43(42-26-24-33-16-12-14-22-40(33)45(42)46-41-23-15-13-17-34(41)25-27-44(46)60)32-58(57-59)31-38-29-39(50(2,3)4)28-37(49(38)61)30-55-47(35-18-8-6-9-19-35)48(36-20-10-7-11-21-36)56-64(62,63)51(52,53)54;1-2(3)4;/h6-30,32,47-48,60H,5,31H2,1-4H3;1H2;/q-3;-1;+4/rC52H47CoF3N6O6S/c1-6-61-44(43-27-25-34-17-13-15-23-41(34)46(43)47-42-24-16-14-18-35(42)26-28-45(47)63)33-59(57-61)31-38-29-40(51(2,3)4)30-39-32-60-48(36-19-9-7-10-20-36)49(37-21-11-8-12-22-37)62(69(65,66)52(54,55)56)53(60,67-50(38)39)68-58(5)64/h7-30,32-33,48-49,63H,5-6,31H2,1-4H3
116 atoms
C  0.97513939 -5.26395787 -0.54972047
C  0.31992879 -4.44172592 -1.41630278
C  -0.79397057 -3.69740084 -0.97691633
C  -1.40071353 -2.71802813 -1.88518014
N  -2.62724332 -2.77403043 -2.46101548
C  -3.57073045 -3.89022654 -2.45934487
C  -4.99999564 -3.44377421 -2.23833458
N  -2.91299514 -1.69637262 -3.12438004
N  -1.87324322 -0.93190757 -2.99788682
C  -0.90292678 -1.50076975 -2.25995474
C  -1.23334227 -3.76474062 0.32817554
C  -2.37863123 -2.92754739 0.76120431
C  -2.22237013 -1.5554325 0.89188096
O  -1.08711404 -0.90345853 0.71637026
C  -3.35320615 -0.75012444 1.19883171
C  -4.57042405 -1.30929424 1.42342575
C  -4.75899215 -2.70965702 1.3474594
C  -3.64844166 -3.52485769 1.00884353
C  -3.86335626 -4.92092808 0.9046941
C  -5.1022774 -5.4652969 1.11607099
C  -6.19842926 -4.65107599 1.45067734
C  -6.02085469 -3.29947696 1.56628515
C  -0.54541062 -4.60491485 1.24380163
C  0.56348873 -5.36590832 0.79616779
C  1.24552254 -6.19600841 1.71291012
C  0.85593347 -6.25809812 3.02056076
C  -0.23335189 -5.48772701 3.47115841
C  -0.91717394 -4.68137436 2.60543354
H  1.83196567 -5.83482317 -0.88473151
H  0.65556513 -4.34484857 -2.44041633
H  -3.45714017 -4.41478914 -3.40911923
H  -3.24483922 -4.56083693 -1.66868034
H  -5.63097958 -4.327177 -2.15895915
H  -5.09801729 -2.88417604 -1.31062007
H  -5.36789043 -2.83408754 -3.06094563
H  0.03294647 -1.03252603 -2.00413066
H  -3.21277738 0.32235194 1.24861727
H  -5.41789811 -0.67937781 1.66701879
H  -3.03283998 -5.57242256 0.66405286
H  -5.23546227 -6.53625244 1.03354745
H  -7.17094012 -5.0931881 1.62005201
H  -6.85564146 -2.6591503 1.8259017
H  2.09071443 -6.77689588 1.36476627
H  1.38749405 -6.89394878 3.71606709
H  -0.52753892 -5.53364513 4.51124151
H  -1.74791261 -4.08648888 2.9601383
C  -1.94500938 0.46458618 -3.46148789
C  -2.24796196 1.36785373 -2.30569822
C  -1.17138567 1.73707008 -1.46242434
O  0.02343302 1.39286189 -1.79556784
Co 1.53326291 1.22561304 -0.58194148
N  2.97209797 2.55753378 -0.20814798
S  4.48303947 2.32171492 -0.62613114
C  4.80036655 3.55416351 -1.9600915
F  6.0255355 3.40371367 -2.44650794
F  3.92940861 3.39888552 -2.95317131
F  4.68051164 4.78915279 -1.48504761
O  5.44271699 2.67751388 0.40431719
O  4.56863695 1.04743215 -1.31849899
C  2.63351651 3.53034682 0.81418724
C  1.59024439 2.8446846 1.7474224
N  0.59225137 2.32625767 0.84062881
C  -0.56067755 2.8523972 0.7173368
C  -1.51947892 2.48645288 -0.30036832
C  -2.83893162 2.89848116 -0.10590728
C  -3.88278835 2.56201058 -0.95209296
C  -5.29977294 3.04833906 -0.66723063
C  -6.29597217 2.56008306 -1.71890366
C  -5.76008577 2.52762787 0.70013385
C  -5.32239345 4.58212333 -0.66070443
C  -3.54661797 1.76321512 -2.04538174
H  3.50716408 3.80117433 1.41283433
H  1.16268416 3.60440503 2.41587499
H  -0.87367631 3.62804964 1.42225092
H  -3.0423356 3.50296096 0.7729824
H  -6.35487983 1.47050172 -1.7532268
H  -7.29481067 2.93013504 -1.48336362
H  -6.04619365 2.9202297 -2.71855536
H  -5.11407336 2.87052942 1.5094242
H  -6.77237502 2.87017522 0.92493517
H  -5.76303607 1.4365676 0.71851601
H  -4.66285458 4.9973818 0.10232443
H  -5.00264063 4.98336922 -1.62326909
H  -6.32934866 4.95338116 -0.45848077
H  -4.32044346 1.43441242 -2.72878085
C  2.16035565 1.70700559 2.57515688
C  3.45691485 1.74207971 3.08232541
C  1.36105837 0.60652705 2.87352967
C  3.93591754 0.70681576 3.86870702
C  1.8422501 -0.43350434 3.65500717
C  3.13119109 -0.38514058 4.15865011
H  4.12050218 2.56569208 2.86088788
H  0.35269799 0.54314373 2.48749956
H  4.95020568 0.75092742 4.2428243
H  1.20994531 -1.28931459 3.84795642
H  3.51197357 -1.19719941 4.76455488
C  2.03199899 4.81576561 0.28396952
C  2.04675752 5.94358284 1.10027221
C  1.40579635 4.90159481 -0.95359949
C  1.4456772 7.12600055 0.69995677
C  0.79879477 6.08289881 -1.35625907
C  0.8138494 7.19769126 -0.53317319
H  2.54551378 5.89884718 2.06265338
H  1.39464442 4.04972557 -1.61915517
H  1.47784736 7.99315331 1.34685374
H  0.31550521 6.1298411 -2.32338784
H  0.34444149 8.11889761 -0.85255159
H  -0.98999724 0.69759524 -3.92774472
H  -2.72471041 0.48927197 -4.22006171
O  1.16273853 -2.07556323 0.90770426
N  2.10413465 -1.43984015 0.34170673
C  3.33706798 -1.51987504 0.70259308
H  4.07703979 -0.95535626 0.1621086
H  3.57366616 -2.13581515 1.55192024
O  1.76863113 -0.68605786 -0.68267195
H  -0.22670864 -1.44584379 0.7484499
empdispcorrection: 0.110376966 hartree
orbitalenergy: -7.4668 -7.2466 -6.8043 -6.7418 -6.5654 -1.2441 -1.0833 -0.8429 -0.7564 -0.2212 electronvolt
orbitalenergy: -7.4403 -7.2491 -6.8090 -6.7389 -6.6374 -1.2475 -1.0832 -0.8466 -0.7567 -0.2209 electronvolt
s2: 3.75745570
charge: -0.000000
dipole: -176.567919 171.702866 -4.865054 157.617985 -160.031438 -2.413453 -23.502364 22.891352 -0.611012
quadrupole: 20123.599609 -20433.327608 -309.727999 22026.352125 -22302.247879 -275.895754 6267.549366 -6555.526394 -287.977028 6855.248238 -6868.621659 -13.373421 978.013646 -959.208904 18.804742 -2643.722307 2654.998506 11.276199
temp: 318.15 k
press: 1.013 bar
thermalcorrgfe: 0.8187201740900001 hartree
thermalcorrener: 0.994500010588 hartree
entropy: 1.45892 kJ.mol-1.K-1
thermalcorrenthalpy: 0.995509342058 hartree
