program: TURBOMOLE
programVersion: 7.7.1
title: ChemShell job
elementType: c
basis: def2-mSVP
elementType: n
elementType: o
elementType: h
elementType: co
elementType: s
elementType: f
method: uhf
method: dft
functional: pbeh-3c
elementType: c n o h co s f
basis: def2-mSVP def2-mSVP def2-mSVP def2-mSVP def2-mSVP def2-mSVP def2-mSVP
energy: -5360.447991126 hartree
zeropoint: 1.093125026 hartree
formula: C63H55CoF3N6O7S
InChI: InChI=1/C51H45F3N5O4S.C12H10NO3.Co/c1-5-59-43(42-26-24-33-16-12-14-22-40(33)45(42)46-41-23-15-13-17-34(41)25-27-44(46)60)32-58(57-59)31-38-29-39(50(2,3)4)28-37(49(38)61)30-55-47(35-18-8-6-9-19-35)48(36-20-10-7-11-21-36)56-64(62,63)51(52,53)54;14-12(8-13(15)16)11-6-5-9-3-1-2-4-10(9)7-11;/h6-30,32,47-48,60H,5,31H2,1-4H3;1-7,12H,8H2;/q-3;-1;+4/rC63H55CoF3N6O7S/c1-5-71-54(53-32-30-42-19-14-16-26-51(42)57(53)58-52-27-17-15-20-43(52)31-33-55(58)74)39-69(68-71)37-48-35-50(62(2,3)4)36-49-38-70-59(44-21-8-6-9-22-44)60(45-23-10-7-11-24-45)73(81(77,78)63(65,66)67)64(70,80-61(48)49)79-56(40-72(75)76)47-29-28-41-18-12-13-25-46(41)34-47/h6-36,38-39,56,59-60,74H,5,37,40H2,1-4H3
136 atoms
C  -4.08319691 -3.13062499 2.32282049
C  -2.73553629 -3.28771386 2.45458107
C  -1.9078906 -3.27496136 1.31015223
C  -0.45426976 -3.38546499 1.44779741
N  0.2344839 -4.45240895 1.91673731
C  -0.28739154 -5.70723275 2.44240186
C  -0.10588558 -5.80705482 3.94468001
N  1.5223186 -4.27935412 1.86135269
N  1.68208805 -3.09617183 1.35529036
C  0.5156362 -2.49303659 1.08493096
C  -2.43555399 -3.09490593 0.04523989
C  -1.50658519 -3.07830262 -1.10839686
C  -1.17973913 -1.87063221 -1.69563577
O  -1.85616088 -0.76158976 -1.39675588
C  -0.11081155 -1.82033123 -2.62609756
C  0.58758712 -2.94223896 -2.95504775
C  0.23898746 -4.20077932 -2.41327391
C  -0.83612436 -4.27184843 -1.49200459
C  -1.19479284 -5.54188087 -0.98003556
C  -0.50776404 -6.66949456 -1.34163244
C  0.57580262 -6.59085769 -2.2354753
C  0.93122684 -5.38006318 -2.7623985
C  -3.83728862 -2.92991941 -0.10177337
C  -4.66732043 -2.95010195 1.0492566
C  -6.06129677 -2.777485 0.8970207
C  -6.60803434 -2.59884522 -0.34221131
C  -5.78512369 -2.58184162 -1.48580862
C  -4.43343855 -2.7426317 -1.3695517
H  -4.71805123 -3.12469863 3.19985756
H  -2.29078216 -3.37786485 3.43670348
H  -1.33855315 -5.7444831 2.16420171
H  0.22240454 -6.51288579 1.91706757
H  0.94706105 -5.78127725 4.21953128
H  -0.61503932 -4.99518635 4.46257936
H  -0.52452578 -6.74772934 4.29884642
H  0.42944643 -1.50140718 0.68417553
H  0.15147617 -0.86261026 -3.05700339
H  1.42267485 -2.87558897 -3.64082667
H  -2.04933145 -5.62427611 -0.31986125
H  -0.81303488 -7.63297727 -0.95345739
H  1.11215765 -7.48750014 -2.51554994
H  1.75152791 -5.31259316 -3.46588579
H  -6.69073983 -2.78600186 1.77811802
H  -7.67710632 -2.46916437 -0.44907877
H  -6.22877345 -2.43541335 -2.4612436
H  -3.80576525 -2.72820372 -2.24944706
C  3.04365467 -2.56292072 1.16122483
C  3.23664411 -1.9355963 -0.18550657
C  2.72529518 -0.62431017 -0.38070881
O  2.14261397 -0.0466795 0.60736791
Co 0.85204011 1.42879778 0.56029533
N  1.27337608 3.39264447 0.78682636
S  0.85013543 4.3170433 2.00288012
C  2.3954844 4.65707524 2.95372093
F  3.22629161 5.40638827 2.23909724
F  2.10207818 5.30290994 4.07518935
F  3.01040972 3.52214787 3.26765837
O  0.39509901 5.6369145 1.60408882
O  0.06369445 3.53192894 2.94174581
C  1.79051724 4.03642709 -0.41246454
C  1.22126838 3.26544834 -1.63810657
N  1.50669996 1.87812498 -1.35530275
C  2.40515338 1.25277949 -2.00961188
C  2.91661347 -0.05400897 -1.6659807
C  3.66877092 -0.73715771 -2.63001326
C  4.19750557 -1.99684231 -2.42672116
C  5.06776904 -2.72368962 -3.44636407
C  6.45356956 -2.97477081 -2.83626442
C  4.43334491 -4.06685808 -3.82493672
C  5.25173741 -1.90964729 -4.72686658
C  3.93396909 -2.58350952 -1.18123342
H  1.44423165 5.07088188 -0.47882784
H  1.76965186 3.60045346 -2.52990089
H  2.83982179 1.72048379 -2.89856414
H  3.83123279 -0.23131066 -3.57462163
H  6.9309545 -2.03669063 -2.55063942
H  6.40128256 -3.60175484 -1.94505513
H  7.10519362 -3.48065441 -3.55187261
H  3.47143128 -3.91838078 -4.31882256
H  5.07651993 -4.61708403 -4.51484027
H  4.26504318 -4.7046773 -2.95595346
H  4.30172525 -1.70894578 -5.22581736
H  5.74503295 -0.95477018 -4.53787587
H  5.87557281 -2.46143374 -5.43136906
H  4.31079372 -3.58031378 -0.97477467
C  -0.25950879 3.49235584 -1.87115919
C  -0.80364861 4.77386097 -1.81952644
C  -1.09290364 2.43798016 -2.22377282
C  -2.13907937 4.98845566 -2.1181337
C  -2.4354393 2.64643566 -2.50259682
C  -2.96304868 3.92474502 -2.4568404
H  -0.19106541 5.62372914 -1.54865598
H  -0.70229141 1.43379936 -2.28791361
H  -2.53936346 5.99300061 -2.07157319
H  -3.06459245 1.79842408 -2.73692377
H  -4.01174812 4.08999785 -2.66626603
C  3.30238397 4.06092379 -0.51448976
C  3.89905473 5.05260853 -1.28799553
C  4.11790279 3.10567854 0.08124133
C  5.27208644 5.09164066 -1.4701661
C  5.49287334 3.13905589 -0.10218185
C  6.07589813 4.1292288 -0.87690432
H  3.27891149 5.81551046 -1.74643484
H  3.69133195 2.33224134 0.70440767
H  5.71473193 5.8790432 -2.06633639
H  6.11077883 2.38707733 0.37101673
H  7.14930718 4.15660529 -1.01127596
H  3.20938958 -1.84000237 1.95998177
H  3.70856648 -3.41107827 1.30921117
H  -6.00131311 5.14428012 -0.1410595
C  -6.15818068 4.0730483 -0.18434714
C  -7.35218212 3.56697934 -0.61894984
C  -7.55375609 2.1734014 -0.67514073
C  -6.55791921 1.31784207 -0.29317767
C  -5.31547953 1.81298468 0.16159973
C  -5.11074099 3.21343259 0.21437285
C  -3.85623385 3.6997203 0.6461553
C  -2.85868368 2.84446715 1.00793994
C  -3.06728475 1.44581418 0.98994193
C  -4.26915624 0.95241101 0.56307865
H  -8.14730766 4.23561906 -0.92199806
H  -8.50189368 1.78413671 -1.02287349
H  -6.70464643 0.2451915 -0.33586472
H  -4.43002863 -0.11933665 0.51722833
H  -1.90377685 3.25182706 1.31005796
H  -3.6817764 4.7679978 0.66986648
C  -1.9582022 0.49880198 1.39040979
O  -0.88917935 0.5457335 0.51314052
H  -2.38626254 -0.51598363 1.40218587
C  -1.56427339 0.81039301 2.84704777
H  -2.38331401 0.55392211 3.51489765
H  -1.40816727 -0.17485641 -0.67898497
H  -1.27170142 1.84839782 2.98434539
N  -0.39731433 -0.01674472 3.2179981
O  -0.58500596 -1.07311744 3.7741412
O  0.69658415 0.38930107 2.89142463
empdispcorrection: 0.123081597 hartree
orbitalenergy: -7.3294 -7.2120 -6.8638 -6.6178 -6.5028 -1.5157 -1.0163 -0.9666 -0.8337 -0.7929 electronvolt
orbitalenergy: -7.3303 -7.2140 -6.8645 -6.6788 -6.5061 -1.5169 -1.0187 -0.9558 -0.8325 -0.8127 electronvolt
s2: 3.75638715
charge: -0.000000
dipole: -40.594873 40.751389 0.156516 118.806942 -124.421901 -5.614959 -17.391932 16.456845 -0.935086
quadrupole: 23981.070799 -24307.006368 -325.935568 25631.570519 -25967.724918 -336.154399 9104.288119 -9457.128295 -352.840177 1233.954810 -1238.804741 -4.849931 -2271.864256 2256.824604 -15.039652 2188.311215 -2221.966055 -33.654840
temp: 300.00 k
press: 1.013 bar
thermalcorrgfe: 0.984006772098 hartree
thermalcorrener: 1.162685103874 hartree
entropy: 1.57205 kJ.mol-1.K-1
thermalcorrenthalpy: 1.1636334945759998 hartree
