program: TURBOMOLE
programVersion: 7.7.1
title: ChemShell job
elementType: h
basis: def2-mSVP
elementType: c
elementType: o
elementType: n
method: uhf
method: dft
functional: pbeh-3c
elementType: h c o n
basis: def2-mSVP def2-mSVP def2-mSVP def2-mSVP
frequency: -0.00 -0.00 0.0000 0.0000 0.0000 0.0000 32.91 51.99 58.67 75.39 154.33 183.76 192.37 215.56 268.51 337.23 365.87 399.16 426.87 449.80 505.63 532.47 538.78 567.10 608.28 650.84 664.43 705.84 741.88 793.00 811.44 817.78 840.27 876.29 914.79 923.03 957.53 961.70 989.97 999.73 1015.94 1035.08 1051.77 1080.16 1086.99 1178.12 1191.99 1206.12 1220.24 1235.19 1255.04 1284.68 1319.29 1330.95 1352.17 1356.16 1410.01 1447.98 1461.48 1470.22 1486.66 1512.72 1529.86 1556.40 1561.05 1614.28 1696.60 1723.04 1761.56 1829.84 3081.51 3162.12 3234.72 3238.35 3259.15 3260.14 3263.14 3278.03 3280.61 3290.29 3929.83
irintensity: 0.00000 0.00000 0 0 0 0 1.00126 1.10619 0.25859 1.49445 3.87764 1.10325 2.18472 5.98546 10.38178 130.83929 33.70783 2.20714 1.72114 5.19986 22.24478 7.08350 2.90220 11.83689 14.53415 2.30324 8.22290 1.66208 43.64162 51.60763 0.15223 0.30564 1.19958 30.48768 18.99014 5.28962 2.76340 16.84787 23.00455 1.67781 4.33135 1.62891 0.00954 5.43946 28.11592 40.20890 35.93402 2.20195 1.24655 13.26546 20.71604 1.50997 0.46918 7.98652 10.23172 96.34097 7.34280 9.87485 1.57319 14.77670 0.81699 11.73299 2.29403 153.95342 0.74114 9.40461 0.37984 7.43858 0.70066 306.84906 11.06830 0.36708 0.67302 5.73138 0.57914 4.88439 0.45410 12.42377 3.92479 12.20298 61.44957
energy: -742.6237346535 hartree
zeropoint: 0.21717766196000002 hartree
formula: C12H11NO3
InChI: InChI=1/C12H11NO3/c14-12(8-13(15)16)11-6-5-9-3-1-2-4-10(9)7-11/h1-7,12,14H,8H2
27 atoms
H  -5.1859368 -0.89299906 -3.21145653
C  -4.89360405 -0.53300856 -2.23260363
C  -4.36933287 0.7207482 -2.08682255
C  -3.99110165 1.18931723 -0.81286679
C  -4.14363468 0.39389621 0.28786463
C  -4.67959872 -0.90790751 0.16742308
C  -5.06236291 -1.37809479 -1.11337215
C  -5.60598258 -2.67807668 -1.22459229
C  -5.75910795 -3.47385463 -0.12610881
C  -5.37168486 -3.01342937 1.15341497
C  -4.85114701 -1.75479297 1.28496711
H  -4.24328017 1.35985776 -2.95055051
H  -3.5783435 2.18403368 -0.70992732
H  -3.85302751 0.75448844 1.26706644
H  -4.56324909 -1.38689182 2.26474749
H  -6.1882553 -4.46227094 -0.22981182
H  -5.90597266 -3.03889891 -2.20099881
C  -5.51146744 -3.91832776 2.35538654
H  -5.4610696 -3.30420786 3.26425328
C  -4.34564813 -4.89104602 2.37434344
H  -4.35482538 -5.54520183 1.50467129
H  -3.39853832 -4.35122864 2.40212238
O  -6.67372797 -4.70149882 2.32180248
H  -7.4385641 -4.126169 2.40296888
N  -4.36932933 -5.76162613 3.59022213
O  -4.16837708 -6.93671181 3.43190462
O  -4.5523808 -5.21460841 4.64896754
nucrepener: 1022.558838598 hartree
empdispcorrection: 0.033806169 hartree
orbitalenergy: -9.7917 -9.5574 -9.3985 -8.0447 -7.3120 -0.9977 -0.5636 -0.1816 1.0701 2.9124 electronvolt
s2: -0.00000000
charge: -0.000000
dipole: -1057.151561 1057.003807 -0.147754 -603.637126 605.254259 1.617134 212.250794 -213.503565 -1.252771
quadrupole: 10057.567503 -10121.093835 -63.526331 5653.007829 -5745.281188 -92.273359 2207.982662 -2283.773397 -75.790735 5775.906300 -5786.809837 -10.903537 -1943.236457 1954.386232 11.149775 -2817.643326 2836.168634 18.525308
temp: 300.00 k
press: 1.013 bar
thermalcorrgfe: 0.17556273501199998 hartree
thermalcorrener: 0.23029897106999997 hartree
entropy: 0.48737 kJ.mol-1.K-1
thermalcorrenthalpy: 0.23125117056999997 hartree
