program: TURBOMOLE
programVersion: 7.7.1
title: ChemShell job
elementType: c
basis: def2-mSVP
elementType: n
elementType: o
elementType: h
elementType: co
elementType: s
elementType: f
method: uhf
method: dft
functional: pbeh-3c
elementType: c n o h co s f
basis: def2-mSVP def2-mSVP def2-mSVP def2-mSVP def2-mSVP def2-mSVP def2-mSVP
energy: -5360.395881670 hartree
zeropoint: 1.089316228 hartree
formula: C63H55CoF3N6O7S
InChI: InChI=1/C51H45F3N5O4S.C11H8O.CH2NO2.Co/c1-5-59-43(42-26-24-33-16-12-14-22-40(33)45(42)46-41-23-15-13-17-34(41)25-27-44(46)60)32-58(57-59)31-38-29-39(50(2,3)4)28-37(49(38)61)30-55-47(35-18-8-6-9-19-35)48(36-20-10-7-11-21-36)56-64(62,63)51(52,53)54;12-8-9-5-6-10-3-1-2-4-11(10)7-9;1-2(3)4;/h6-30,32,47-48,60H,5,31H2,1-4H3;1-8H;1H2;/q-3;2*-1;+5/rC63H55CoF3N6O7S/c1-6-72-55(54-33-31-44-20-15-17-27-52(44)57(54)58-53-28-18-16-21-45(53)32-34-56(58)74)40-70(68-72)38-49-36-51(62(2,3)4)37-50-39-71-59(46-22-9-7-10-23-46)60(47-24-11-8-12-25-47)73(81(76,77)63(65,66)67)64(71,79-61(49)50,80-69(5)75)78-41-42-29-30-43-19-13-14-26-48(43)35-42/h7-37,39-41,59-60,74H,5-6,38H2,1-4H3
136 atoms
C  -4.05804742 -1.56658777 3.95193092
C  -2.89107101 -2.23747328 3.75170315
C  -2.48635445 -2.59614603 2.44791759
C  -1.13507162 -3.15467033 2.28938866
N  -0.76774658 -4.3674579 1.80734722
C  -1.61904587 -5.49210577 1.42780233
C  -1.21849598 -6.08390088 0.09232865
N  0.52193841 -4.50757611 1.7484586
N  1.00207719 -3.38701803 2.19206916
C  0.05141265 -2.51457381 2.54806684
C  -3.26472348 -2.27156496 1.35189463
C  -2.83789719 -2.65395857 -0.01583741
C  -1.72602963 -2.05740173 -0.57030581
O  -1.02507165 -1.09774108 0.04186752
C  -1.25702915 -2.44576852 -1.84835237
C  -1.94711174 -3.36309096 -2.57963071
C  -3.12027341 -3.97079201 -2.07300455
C  -3.55951063 -3.62507577 -0.7687544
C  -4.70226644 -4.2828239 -0.25508731
C  -5.36753109 -5.22022407 -0.99748209
C  -4.93470904 -5.55295981 -2.29363252
C  -3.83149262 -4.93678386 -2.81634457
C  -4.45438306 -1.51135928 1.54384528
C  -4.85599407 -1.16581077 2.85941946
C  -6.0208725 -0.38824919 3.04434616
C  -6.7419424 0.05355836 1.97161144
C  -6.33125022 -0.2656795 0.66302509
C  -5.22214292 -1.03614416 0.45509854
H  -4.35874095 -1.29145845 4.95470384
H  -2.24940282 -2.47908853 4.58738704
H  -1.56089501 -6.2326783 2.22644168
H  -2.63740864 -5.11351962 1.40298649
H  -0.24172937 -6.56049431 0.14151479
H  -1.95241707 -6.83401647 -0.19804901
H  -1.19465817 -5.32162418 -0.68343906
H  0.20354421 -1.49915349 2.91993037
H  -0.34421897 -2.00255019 -2.22689379
H  -1.58928043 -3.64720554 -3.5619028
H  -5.0603723 -4.03712083 0.7362337
H  -6.24076745 -5.70713035 -0.58339277
H  -5.47298698 -6.29476583 -2.86754095
H  -3.48393387 -5.19117242 -3.81062173
H  -6.32076776 -0.13199729 4.05300884
H  -7.62478815 0.65994747 2.12452328
H  -6.88747698 0.11028786 -0.18560983
H  -4.91307744 -1.26228678 -0.5555669
C  2.45168891 -3.14740542 2.18535681
C  2.976647 -2.83858961 0.82148849
C  2.80705817 -1.51805091 0.30683226
O  2.14887012 -0.6527303 0.97425351
Co 1.52952948 1.23511478 0.59484184
N  2.35885301 3.13576087 0.45706521
S  1.69328062 4.43408079 1.07632537
C  2.47139937 4.61660563 2.73895106
F  3.77193041 4.86004741 2.60175337
F  1.92030561 5.63180582 3.39565842
F  2.32567487 3.51545152 3.46204763
O  2.08872469 5.66235626 0.39399073
O  0.28775858 4.22088771 1.36595648
C  3.40641863 3.30154406 -0.52900948
C  3.08630475 2.35579607 -1.70771288
N  2.82929462 1.06122255 -1.11335709
C  3.5064098 0.05555728 -1.50214912
C  3.45131552 -1.26726874 -0.93641237
C  4.14054796 -2.28382581 -1.60885973
C  4.23910301 -3.57622156 -1.13514402
C  4.96095192 -4.70192462 -1.86533011
C  3.97330741 -5.84379826 -2.14010662
C  5.54007159 -4.24003521 -3.20252356
C  6.11388109 -5.22556972 -0.99879059
C  3.64539949 -3.81075432 0.11064189
H  3.43963486 4.3239439 -0.91762378
H  3.97332131 2.30728093 -2.3551392
H  4.22217439 0.18319011 -2.32223863
H  4.61839899 -2.01671139 -2.54447817
H  4.46716058 -6.67054493 -2.65550679
H  3.54693347 -6.24320164 -1.21867463
H  3.14569158 -5.50330232 -2.76428468
H  6.28240884 -3.44995732 -3.07718096
H  6.0375716 -5.07303647 -3.70170903
H  4.76565389 -3.87365819 -3.87884752
H  6.83555967 -4.43557046 -0.78712708
H  5.76178085 -5.6132848 -0.04191854
H  6.6413815 -6.03835993 -1.50297517
H  3.72361375 -4.79747577 0.55662493
C  1.90584323 2.74332814 -2.58273772
C  1.18080961 3.92013389 -2.44115539
C  1.52608483 1.85152477 -3.58476331
C  0.08261605 4.17462347 -3.25277612
C  0.43271956 2.10333806 -4.39698
C  -0.30694044 3.26533128 -4.22203656
H  1.44653131 4.6569048 -1.69818817
H  2.08163414 0.93194317 -3.72715436
H  -0.47803621 5.08917372 -3.11079562
H  0.15663188 1.39209357 -5.16569717
H  -1.1734882 3.46073521 -4.83949129
C  4.79747692 2.98042642 -0.01628624
C  5.89664329 3.43061802 -0.74244768
C  5.02371443 2.22827219 1.12840609
C  7.18979984 3.13144755 -0.34594075
C  6.31746297 1.92412478 1.52809154
C  7.40461049 2.36998274 0.79380965
H  5.73682403 4.04130198 -1.62490391
H  4.1925522 1.89628541 1.73414153
H  8.02915662 3.50327783 -0.91910106
H  6.4736382 1.34143248 2.4265134
H  8.41227979 2.13757474 1.1129122
H  2.61294669 -2.3189793 2.8732298
H  2.9180937 -4.039871 2.60023975
H  -6.64531258 3.67400845 -1.34412344
C  -6.30938781 2.75849017 -1.81514949
C  -7.20266834 1.94431969 -2.45640928
C  -6.77117833 0.74899482 -3.06572274
C  -5.45031654 0.39863164 -3.02726966
C  -4.50607971 1.22316212 -2.37599954
C  -4.94062345 2.42050847 -1.75267908
C  -3.99330753 3.23670135 -1.08517224
C  -2.6825898 2.87411814 -1.00790293
C  -2.25274637 1.67563907 -1.62630301
C  -3.13951229 0.88368187 -2.30892872
H  -8.24927628 2.21610503 -2.49628012
H  -7.48934996 0.11233497 -3.56492481
H  -5.11285762 -0.51960163 -3.4936523
H  -2.79861362 -0.0310648 -2.78294574
H  -1.96034754 3.49236646 -0.49003763
H  -4.32871231 4.15648771 -0.62294676
C  -0.87694141 1.20690036 -1.47546021
O  -0.12278742 1.66177513 -0.64562595
H  -0.56387269 0.39755919 -2.14981852
C  -1.65648283 1.66400209 2.17753184
H  -1.45738343 2.56653588 1.6321088
H  -1.48036948 -0.75171198 0.82345818
H  -2.64571474 1.37765215 2.49323013
N  -0.65241901 0.9668785 2.62644823
O  -0.81767753 -0.03513533 3.37657422
O  0.56639235 1.27860319 2.32647884
empdispcorrection: 0.120263478 hartree
orbitalenergy: -7.2451 -7.0920 -7.0001 -6.2299 -5.9661 -1.6131 -1.4497 -1.2539 -1.0933 -0.6785 electronvolt
orbitalenergy: -7.2447 -7.1939 -6.9721 -6.2116 -5.9712 -1.6067 -1.4495 -1.2541 -1.0932 -0.6791 electronvolt
s2: 3.75604629
charge: -0.000000
dipole: -8.958123 5.252882 -3.705240 -94.126545 87.532445 -6.594101 -10.172316 8.048057 -2.124260
quadrupole: 29318.622786 -29632.884756 -314.261969 22571.744980 -22924.015061 -352.270081 9416.416249 -9759.378274 -342.962025 4185.051516 -4197.873775 -12.822258 596.965986 -601.698240 -4.732254 861.911179 -878.896954 -16.985774
temp: 300.00 k
press: 1.013 bar
thermalcorrgfe: 0.97768035862 hartree
thermalcorrener: 1.1597409030199999 hartree
entropy: 1.60166 kJ.mol-1.K-1
thermalcorrenthalpy: 1.16069310252 hartree
