program: TURBOMOLE
programVersion: 7.7.1
title: ChemShell job
elementType: c
basis: def2-mSVP
elementType: n
elementType: o
elementType: h
elementType: co
elementType: s
elementType: f
method: uhf
method: dft
functional: pbeh-3c
elementType: c n o h co s f
basis: def2-mSVP def2-mSVP def2-mSVP def2-mSVP def2-mSVP def2-mSVP def2-mSVP
energy: -5360.425394839 hartree
zeropoint: 1.093125026 hartree
formula: C63H55CoF3N6O7S
InChI: InChI=1/C51H44F3N5O4S.C12H11NO3.Co/c1-5-59-43(42-26-24-33-16-12-14-22-40(33)45(42)46-41-23-15-13-17-34(41)25-27-44(46)60)32-58(57-59)31-38-29-39(50(2,3)4)28-37(49(38)61)30-55-47(35-18-8-6-9-19-35)48(36-20-10-7-11-21-36)56-64(62,63)51(52,53)54;14-12(8-13(15)16)11-6-5-9-3-1-2-4-10(9)7-11;/h6-30,32,47-48H,5,31H2,1-4H3;1-7,12,14H,8H2;/q-3;-1;+4/rC63H55CoF3N6O7S/c1-5-71-54(53-32-30-42-19-14-16-26-51(42)57(53)58-52-27-17-15-20-43(52)31-33-55(58)74)39-69(68-71)37-48-35-50(62(2,3)4)36-49-38-70-59(44-21-8-6-9-22-44)60(45-23-10-7-11-24-45)73(81(77,78)63(65,66)67)64(70,79-61(48)49)80-72(76)40-56(75)47-29-28-41-18-12-13-25-46(41)34-47/h6-36,38-39,56,59-60,75H,5,37,40H2,1-4H3
136 atoms
C  -4.51899249 -5.13788242 -0.23456997
C  -3.78653957 -4.73159146 0.8432649
C  -2.38126873 -4.64467947 0.74456591
C  -1.57611382 -4.26011252 1.90832379
N  -0.96140389 -5.13859142 2.73975169
C  -1.01580588 -6.59764025 2.71519569
C  -1.55083082 -7.16340319 4.01524855
N  -0.23230597 -4.55294848 3.63545159
N  -0.37198196 -3.28537763 3.40899461
C  -1.18512686 -3.03172566 2.36794073
C  -1.71419081 -4.93225944 -0.42850195
C  -0.23337397 -4.86301745 -0.44754995
C  0.40052795 -3.60798459 -0.44267095
O  -0.23803097 -2.48707772 -0.49767895
C  1.83343679 -3.61277459 -0.37214596
C  2.55582971 -4.75526346 -0.26529797
C  1.92791378 -6.02438532 -0.26435997
C  0.51371094 -6.07245031 -0.38871996
C  -0.08938399 -7.35585017 -0.42801495
C  0.65702893 -8.50055404 -0.32372796
C  2.05278177 -8.44049105 -0.17433598
C  2.6674967 -7.21649718 -0.15221298
C  -2.47549772 -5.3268064 -1.56365582
C  -3.88562256 -5.44868938 -1.45894284
C  -4.63121147 -5.84283834 -2.59328371
C  -4.00644154 -6.09650731 -3.77972057
C  -2.60753371 -5.96702932 -3.88670156
C  -1.85968379 -5.58977037 -2.80854568
H  -5.59672537 -5.21920741 -0.16302398
H  -4.27486651 -4.48263849 1.7770008
H  -1.65069382 -6.86341822 1.87448679
H  -0.014321 -6.95956021 2.48814772
H  -0.9138099 -6.90852322 4.86012345
H  -2.56033271 -6.80806223 4.21925752
H  -1.58706682 -8.24885407 3.93913255
H  -1.39280284 -2.04297177 2.00562577
H  2.33470974 -2.6570707 -0.40463495
H  3.63666359 -4.70457247 -0.19177898
H  -1.16138687 -7.43958316 -0.55434794
H  0.16297398 -9.46319092 -0.36503896
H  2.6323437 -9.35005094 -0.09164199
H  3.74508357 -7.14966619 -0.05270099
H  -5.70833335 -5.92178733 -2.51466171
H  -4.58815648 -6.38167428 -4.64589547
H  -2.12566776 -6.1565413 -4.83655645
H  -0.78768991 -5.47619638 -2.89374367
C  0.48548595 -2.34355573 4.13959753
C  1.7921908 -2.19347375 3.42662461
C  1.83352479 -1.33279985 2.30101874
O  0.75919092 -0.69841792 1.97404478
Co 0.41208895 0.13538398 0.27442897
N  0.73327292 2.06989576 -0.09553299
S  -0.37325696 3.14832964 0.24568097
C  -1.04998388 3.68275858 -1.39143284
F  -1.55652782 2.6609407 -2.07097477
F  -2.00981577 4.58185448 -1.21073786
F  -0.08953299 4.23682252 -2.13016576
O  -1.48268583 2.43896972 0.8663679
O  0.13963498 4.3821775 0.80437091
C  2.08482276 2.45010572 -0.44437995
C  2.68474069 1.18895287 -1.15305187
N  2.39946773 0.10012499 -0.24747897
C  3.31395862 -0.34692696 0.52354894
C  3.09088765 -1.22054186 1.64983281
C  4.19008653 -1.96199378 2.10360476
C  4.12128553 -2.85529767 3.15169364
C  5.2799314 -3.73996858 3.59135959
C  4.87311045 -5.21111041 3.42875161
C  6.53501126 -3.4958936 2.75438569
C  5.62112936 -3.46143761 5.06033543
C  2.88671167 -2.93653767 3.80635857
H  2.10783476 3.27403063 -1.16376187
H  3.76758857 1.33531485 -1.25865586
H  4.35283251 -0.05877999 0.33858896
H  5.12450042 -1.82790179 1.57169082
H  4.01007955 -5.46775038 4.04467654
H  4.60962448 -5.43409038 2.39356373
H  5.69086636 -5.87318933 3.72139958
H  7.34093917 -4.14731353 3.09510765
H  6.37049428 -3.71229758 1.69714381
H  6.89183222 -2.46794472 2.84043168
H  5.91752633 -2.42158072 5.20409141
H  4.77687746 -3.65770659 5.72274035
H  6.44613927 -4.09545053 5.39161039
H  2.77550968 -3.61179059 4.64874547
C  2.07536677 0.97262089 -2.52086771
C  1.38577884 -0.18331798 -2.86550967
C  2.21112975 1.97436877 -3.4800916
C  0.80356591 -0.31313396 -4.12003753
C  1.64793981 1.83973879 -4.73662946
C  0.92983689 0.69587292 -5.05825242
H  1.28692786 -1.00640488 -2.17124675
H  2.76316968 2.87740667 -3.24633863
H  0.24149597 -1.20896986 -4.34676351
H  1.7630308 2.6331957 -5.46337638
H  0.47496594 0.59540593 -6.03504031
C  2.97406266 2.83246468 0.71977892
C  4.17205752 3.4891816 0.45081395
C  2.6806177 2.50003372 2.03556677
C  5.06391943 3.79632357 1.46485083
C  3.5747916 2.79984268 3.05359365
C  4.76839846 3.44556961 2.77461269
H  4.4074685 3.77479757 -0.56929794
H  1.7465478 2.01365677 2.27978774
H  5.98497232 4.31589451 1.23447886
H  3.32962562 2.53217871 4.07301854
H  5.46001138 3.68397958 3.57199259
H  -0.05839399 -1.40395884 4.21065252
H  0.61139493 -2.75316569 5.14002141
H  -6.69927924 -3.73818658 -7.0308172
C  -6.98836821 -3.60419459 -5.99535632
C  -8.28183906 -3.81531556 -5.60815937
C  -8.65815302 -3.63736859 -4.26101252
C  -7.73215912 -3.25312963 -3.33244762
C  -6.38591828 -3.03053765 -3.70304858
C  -6.00776132 -3.20982064 -5.05715442
C  -4.65860347 -3.00001566 -5.41517139
C  -3.72529058 -2.6455647 -4.48240849
C  -4.09446653 -2.47556972 -3.13239464
C  -5.40048539 -2.6612747 -2.76508869
H  -9.02384097 -4.11799153 -6.33504628
H  -9.6857709 -3.80433957 -3.96643555
H  -8.02203609 -3.11229964 -2.29781474
H  -5.69086936 -2.55870971 -1.7235838
H  -2.6920017 -2.51448271 -4.76838846
H  -4.36404751 -3.13586464 -6.44897927
C  -3.05921066 -2.12091576 -2.09231276
H  -3.26421863 -2.72117369 -1.19377587
C  -3.29300863 -0.63673993 -1.68614881
H  -3.07098865 0.032814 -2.51357572
H  -4.29989351 -0.47464595 -1.30965485
O  -1.7884688 -2.31753474 -2.57420871
H  -1.15442287 -2.41535972 -1.8083298
N  -2.35462773 -0.34081996 -0.59047493
O  -1.24863986 0.042805 -0.93526189
O  -2.6699407 -0.57730293 0.54023994
empdispcorrection: 0.124398017 hartree
orbitalenergy: -7.1139 -6.9741 -6.9374 -6.6541 -5.8431 -1.5865 -1.2501 -0.9573 -0.8518 -0.6594 electronvolt
orbitalenergy: -7.1141 -6.9769 -6.9379 -6.6866 -5.8404 -1.6122 -1.2488 -0.9558 -0.8443 -0.6607 electronvolt
s2: 3.75629727
charge: -0.000000
dipole: -272.308771 271.910140 -0.398631 -2065.015946 2060.732000 -4.283945 -335.819835 337.216882 1.397047
quadrupole: 23875.393340 -24190.003601 -314.610260 32378.318897 -32728.965546 -350.646649 15470.930541 -15794.514779 -323.584238 6686.028217 -6662.550563 23.477653 11722.301577 -11715.284182 7.017395 316.009156 -342.312880 -26.303724
temp: 318.15 k
press: 1.013 bar
thermalcorrgfe: 0.972687024442 hartree
thermalcorrener: 1.1700779807919999 hartree
entropy: 1.63724 kJ.mol-1.K-1
thermalcorrenthalpy: 1.171083503464 hartree
