program: Gaussian 09
title: 000076378
version: EM64L-G09RevD.01
frameworkgroup: C1[X(C18H23N3O)]
method: RPBEPBE
basis: SDD
operation: Freq
keyword: #p
keyword: freq=noraman
keyword: PBEPBE/SDD
title: #p freq=noraman PBEPBE/SDD
converged: YES YES NO NO
title: Mulliken charges:
elementType: O N N N C C C C C C C C C C C C C C C C C C H H H H H H H H H H H H H H H H H H H H H H H
charge: -0.262445 -0.153367 -0.117353 -0.131682 -0.398541 -0.398875 0.458675 -0.332803 -0.350714 -0.659920 -0.659814 -0.326328 -0.379333 0.149750 0.152130 0.334607 -0.306821 -0.328050 -0.323806 -0.353109 -0.245153 -0.684869 0.227905 0.222584 0.228522 0.222235 0.226297 0.227829 0.217113 0.241683 0.216092 0.217199 0.241744 0.216297 0.270105 0.242523 0.270527 0.247878 0.241901 0.249070 0.209543 0.209411 0.206678 0.232344 0.232342
chargesum: 0.00000
title: Mulliken charges with hydrogens summed into heavy atoms:
elementType: O N N N C C C C C C C C C C C C C C C C C C
charge: -0.262445 -0.153367 -0.117353 -0.131682 0.051947 0.051882 0.458675 -0.106506 -0.122885 0.014968 0.015426 -0.056222 -0.136810 0.149750 0.152130 0.334607 -0.036295 -0.080173 -0.081905 -0.104039 0.173801 -0.013505
polarizability: 6.42620910e+02 9.01454486e+00 2.06484835e+02 -1.93361338e+00 -1.28381548e+01 1.20048285e+02
1716.lowfreq: -13.1456 -3.1337 -0.0006 0.0011 0.0015 2.8698 18.8082 27.5717 37.8318
frequency: 18.6228 26.8642 37.8116 47.3162 59.2735 78.6941 86.5639 99.6976 114.3762 118.0764 128.5467 172.9856 176.7364 201.7036 207.7593 217.3254 234.0751 247.5100 299.5593 307.3990 335.4632 346.9857 384.7854 395.5131 413.0030 424.2830 435.5364 446.2385 498.8894 511.4040 523.7661 537.1966 555.0858 592.0021 623.9398 636.7917 690.0121 730.9370 745.0630 754.7620 784.0756 785.1782 802.7388 811.5873 823.3892 826.8550 832.8968 848.5043 890.2637 899.4487 901.6716 922.6761 958.0630 965.5688 974.6973 979.4016 987.7587 992.6996 1013.7648 1035.6231 1072.2236 1075.4372 1093.9848 1104.2137 1117.5195 1120.7105 1135.6292 1140.6474 1157.2598 1161.9656 1196.9287 1200.1685 1219.8291 1260.5309 1263.6831 1266.3857 1285.7587 1290.9974 1307.4927 1334.5814 1340.3475 1349.6893 1361.4884 1370.2013 1379.7885 1383.8922 1386.9452 1399.4425 1400.4989 1431.8935 1453.8927 1461.6538 1464.8037 1466.0853 1473.6632 1477.1596 1481.6970 1482.4470 1492.5923 1493.2841 1501.0513 1515.8080 1550.6472 1572.2620 1609.4445 1622.4613 2956.2711 2983.8252 2984.4968 2993.0576 2996.8441 2998.8115 3015.0836 3042.2497 3047.5984 3080.2050 3080.7118 3092.6951 3094.1283 3094.4605 3106.0269 3142.6083 3145.7165 3147.6217 3149.0103 3165.3621 3167.6425 3169.8307 3172.4126
redmass: 4.2540 3.4984 4.5908 3.6831 3.0598 4.3137 3.3658 3.4154 4.0435 1.8095 3.6536 4.3149 2.2474 1.4275 1.3221 4.2750 2.8366 1.2415 3.0937 3.2508 3.2853 5.7192 4.7486 3.4658 3.6210 3.4515 3.8678 3.1895 3.2152 3.0521 3.6910 3.1570 2.4694 4.8778 7.0658 7.0600 4.3727 3.8193 3.9899 4.1571 1.2499 1.1411 1.2814 1.2142 5.1184 1.7119 1.1660 1.5822 2.2660 5.0136 4.2534 2.1669 1.3512 1.3593 1.3366 1.3369 2.7743 2.5626 2.9783 2.7886 2.1850 1.8161 1.6643 1.3617 1.9991 1.4503 1.4385 1.7445 1.5539 1.6054 1.7345 2.4425 3.5886 2.8525 1.1433 1.4391 1.2069 1.3351 1.4782 5.0071 1.2933 1.4326 1.9120 2.7354 3.0004 1.2195 1.2871 1.6600 1.4995 4.2211 3.5195 1.0400 1.0652 1.0456 1.4291 1.0822 1.2724 1.0742 1.2388 1.1061 1.5193 1.7819 6.5080 7.8090 6.2708 6.3668 1.0554 1.0355 1.0356 1.0605 1.0363 1.0609 1.1075 1.1023 1.1020 1.0997 1.0996 1.1011 1.0989 1.1008 1.1014 1.0875 1.0863 1.0868 1.0877 1.0951 1.0956 1.0957 1.0971
irintensity: 2.2692 0.0250 1.7603 0.0730 0.0334 0.3859 1.7324 0.2491 0.1659 2.1806 0.6282 0.0780 1.4508 1.6220 1.1675 0.4485 0.0778 1.3830 2.8910 0.2534 2.3099 2.1145 4.0793 3.3315 1.7062 0.2490 2.1242 5.8581 35.5741 39.4444 4.7680 19.9127 21.6406 13.9553 1.0942 1.4692 0.4512 0.1463 7.0085 16.5089 15.6004 5.5988 2.2002 9.7541 1.4692 41.5179 22.3434 78.6307 0.0685 16.5257 62.4288 3.7086 1.9807 1.7309 0.8374 2.5317 0.1562 4.3895 67.6831 121.0523 13.0925 62.3246 18.2969 20.0285 8.8622 3.2904 4.5362 6.3840 366.6986 63.7162 24.2921 42.6754 488.7606 80.7151 0.2017 189.8296 2.4160 13.7616 11.6889 172.5165 19.9260 112.3914 0.9317 17.8699 32.8875 2.4452 34.3197 200.8694 2.1668 0.0924 5.0710 11.7927 5.4043 6.8135 130.7083 0.6856 32.0742 1.2246 3.0598 32.4775 105.2226 125.0822 59.7191 2.9440 328.4424 570.6486 44.6557 37.7052 34.9128 50.0418 44.6020 92.6893 35.7200 5.4696 10.1785 38.6653 58.2941 17.6950 31.9234 82.4791 35.3448 9.2894 11.1287 20.1134 0.0296 23.6592 18.3934 34.1647 15.5435
temp: 298.150 k
press: 1.00000 atm
elementType: 8 7 7 7 6 6 6 6 6 6 6 6 6 6 6 6 6 6 6 6 6 6 1 1 1 1 1 1 1 1 1 1 1 1 1 1 1 1 1 1 1 1 1 1 1
symmnumber: 1
zpe: 981267.8 jmol-1
zpe.correction: 0.373745 hartree
zpe.thermalcorrener: 0.395959 hartree
zpe.thermalcorrenthalpy: 0.396903 hartree
zpe.thermalcorrgfe: 0.320361 hartree
zpe.sumelectzpe: -937.516506 hartree
zpe.sumelectthermal: -937.494292 hartree
zpe.sumelectthermalent: -937.493348 hartree
zpe.sumelectthermalfe: -937.569890 hartree
dipole: -3.8370 -1.5312 0.3527
dipole: 4.1463
quadrupole: -72.5901 -120.5028 -136.7803
quadrupole: -11.4677 2.4346 -3.5436
quadrupole: 37.3676 -10.5450 -26.8226 -11.4677 2.4346 -3.5436
hfenergy: -937.8902514 hartree
pointgroup: C01 [X(C18H23N3O1)]
dipole: 1.5099401 -0.5190277 0.334336 debye
polarizability: 642.209394|-16.0967014|168.9994033|-6.8887172|-44.470963|157.9452333 unknown
InChI: InChI=1S/C18H23N3O/c1-4-21(5-2)17-11-7-15(8-12-17)19-20-16-9-13-18(14-10-16)22-6-3/h7-14H,4-6H2,1-3H3
charge 0 multiplicity 1
45 atoms
O  -6.596495 0.513995 0.011659
N  5.433062 -0.002766 -0.044558
N  -0.242022 -0.205329 0.342396
N  -0.952417 0.678832 -0.327415
C  6.267692 -1.032531 0.608228
C  6.150379 1.057291 -0.783088
C  4.038223 -0.030924 0.035812
C  3.228734 0.910855 -0.692303
C  3.353673 -0.998786 0.844444
C  6.606467 -0.710025 2.083011
C  6.321795 0.753314 -2.290372
C  1.833184 0.887122 -0.612526
C  1.954043 -1.019537 0.910736
C  1.162571 -0.082881 0.191392
C  -2.364483 0.542177 -0.169625
C  -5.195817 0.464289 -0.003759
C  -3.013267 -0.450099 0.618261
C  -3.159268 1.49163 -0.872629
C  -4.416274 -0.493007 0.703493
C  -4.559715 1.457253 -0.79298
C  -7.318866 -0.494117 0.814237
C  -8.808073 -0.202075 0.651007
H  5.764728 -2.014138 0.535859
H  7.205139 -1.124366 0.027814
H  5.629691 2.02238 -0.643528
H  7.146403 1.176065 -0.316431
H  3.702212 1.656366 -1.337734
H  3.916369 -1.727388 1.433943
H  7.161091 0.242814 2.159157
H  5.689752 -0.616588 2.690609
H  7.234666 -1.50854 2.519772
H  6.884647 -0.185761 -2.440153
H  5.342383 0.643004 -2.787054
H  6.8760 1.569738 -2.789663
H  1.226517 1.605998 -1.172448
H  1.43623 -1.758965 1.531405
H  -2.39277 -1.175709 1.153372
H  -2.646317 2.248141 -1.475527
H  -4.89431 -1.26477 1.314502
H  -5.182399 2.181034 -1.327171
H  -7.064191 -1.50923 0.44634
H  -7.006457 -0.413166 1.875664
H  -9.403648 -0.928986 1.23284
H  -9.046629 0.813605 1.009718
H  -9.105032 -0.274317 -0.409108
