program: Gaussian 09
title: 000076325
version: EM64L-G09RevD.01
frameworkgroup: C1[X(C8H12O6)]
method: RPBEPBE
basis: SDD
operation: Freq
keyword: #pfreq=noraman
keyword: PBEPBE/SDD
title: #p freq=noraman PBEPBE/SDD
converged: YES YES NO NO
title: Mulliken charges:
elementType: O O O O O O C C C C C C C C H H H H H H H H H H H H
charge: -0.264024 -0.246939 -0.259117 -0.223212 -0.226097 -0.238964 0.051842 -0.325979 0.311797 0.316064 0.300157 -0.749277 -0.754427 -0.745716 0.283585 0.263696 0.239836 0.250867 0.247962 0.261366 0.253027 0.247676 0.256673 0.250437 0.252364 0.246403
chargesum: 0.00000
title: Mulliken charges with hydrogens summed into heavy atoms:
elementType: O O O O O O C C C C C C C C
charge: -0.264024 -0.246939 -0.259117 -0.223212 -0.226097 -0.238964 0.335427 0.177553 0.311797 0.316064 0.300157 0.010919 0.002949 0.003488
polarizability: 1.28423241e+02 -9.07209828e+00 9.85593731e+01 3.36204980e+00 -3.45525997e+00 9.28197493e+01
1716.lowfreq: -4.2888 -0.0007 -0.0006 0.0001 4.4089 6.1243 23.2435 28.5060 35.3824
frequency: 23.1566 28.3482 35.3692 39.5772 50.2046 52.2691 62.1951 78.4537 83.1505 123.0012 143.5561 215.0087 222.0404 268.4044 286.4628 325.3975 403.7924 443.2385 467.3838 505.6893 554.3087 559.7985 568.0722 604.4454 621.5430 635.7779 779.1020 805.9700 852.0308 900.6637 929.2858 964.8849 982.6789 994.9657 1006.1499 1042.1243 1042.9313 1043.3792 1061.9184 1142.4873 1173.3469 1185.7104 1206.0386 1232.9838 1306.9924 1342.5501 1369.0428 1384.2352 1384.8854 1386.7064 1451.4374 1451.6469 1452.6754 1453.2161 1453.3852 1454.6063 1460.9774 1668.0330 1669.6849 1678.8343 3007.9988 3009.3115 3010.0595 3035.6649 3059.7747 3097.6603 3099.3704 3100.3017 3111.8299 3144.4552 3145.1677 3146.1361
redmass: 7.7787 5.9154 1.8243 1.5957 1.9035 1.6932 3.4934 1.3837 2.2031 4.5307 5.3061 5.6512 8.3899 4.2893 2.7120 4.4580 3.4065 4.2524 3.3789 3.9406 3.3030 3.1658 3.2458 5.1877 4.7335 5.0868 4.1197 4.2137 6.5525 6.2540 5.6229 3.4722 2.0371 1.8634 2.6574 1.6717 1.6690 1.6657 2.6337 2.6657 2.9444 3.3489 3.5006 1.1824 1.2030 1.2583 1.4357 1.2386 1.2509 1.2820 1.0551 1.0549 1.0519 1.0524 1.0571 1.0487 1.0873 9.7334 9.5199 10.0291 1.0379 1.0372 1.0370 1.0572 1.0860 1.0965 1.0968 1.0950 1.1083 1.1020 1.1014 1.1013
irintensity: 0.8641 0.4566 1.9467 2.5067 3.5230 1.4498 3.1615 1.2624 1.4080 1.8484 1.7926 10.6557 0.2915 1.2238 14.2969 3.7537 17.0481 35.1519 1.1096 1.1333 6.9313 5.0858 5.6242 1.1259 9.0859 10.1970 11.6821 52.2429 11.6870 309.7420 85.3419 69.5888 50.8296 84.6859 143.0569 7.3430 16.1380 5.0895 92.3518 37.6807 216.6348 543.5313 82.9736 8.2208 8.6185 2.4528 3.9943 108.5685 23.4476 40.2735 32.4803 18.0450 10.9038 23.3619 31.4271 16.4348 14.4618 71.7954 274.1798 200.7274 0.7497 0.7933 1.6663 21.0878 9.9315 5.4153 6.8914 6.0452 5.8820 8.6322 9.2670 8.2551
temp: 298.150 k
press: 1.00000 atm
elementType: 8 8 8 8 8 8 6 6 6 6 6 6 6 6 1 1 1 1 1 1 1 1 1 1 1 1
symmnumber: 1
zpe: 514896.3 jmol-1
zpe.correction: 0.196114 hartree
zpe.thermalcorrener: 0.212996 hartree
zpe.thermalcorrenthalpy: 0.213940 hartree
zpe.thermalcorrgfe: 0.146915 hartree
zpe.sumelectzpe: -762.313030 hartree
zpe.sumelectthermal: -762.296148 hartree
zpe.sumelectthermalent: -762.295204 hartree
zpe.sumelectthermalfe: -762.362229 hartree
dipole: -0.4844 0.9040 -0.8973
dipole: 1.3627
quadrupole: -75.2971 -72.8971 -90.0500
quadrupole: -3.3111 -18.1140 0.4412
quadrupole: 4.1176 6.5177 -10.6353 -3.3111 -18.1140 0.4412
hfenergy: -762.5091434 hartree
pointgroup: C01 [X(C8H12O6)]
dipole: 0.047938 -0.3716313 -0.3834491 debye
dipolederiv: -1.1514136 0.8589944 0.2170618 0.5294647 -1.0809175 -0.2256965 0.1537924 -0.2060958 -0.544461 -0.9697257 -0.6316601 0.1700133 -0.5054196 -1.3561253 0.0507825 0.1425758 0.0208982 -0.332872 -1.369028 0.5416904 0.1964397 0.6356195 -0.6402845 -0.1203149 0.2249908 -0.0984884 -0.5276027 -0.5072721 0.1275934 -0.177083 0.1970275 -0.5065348 -0.0974942 0.1012517 -0.3674566 -0.8703159 -0.7106039 -0.2032904 0.2430436 0.078923 -0.5725035 -0.1843467 0.3607185 0.0378212 -0.5463748 -0.6051781 0.1527579 -0.0019875 0.1773001 -0.3923783 0.0563241 0.3456304 -0.1361031 -0.9324651 0.8943205 -0.2541971 -0.0372991 0.0745124 1.3236316 0.0025556 0.2657946 -0.0894162 0.2838481 0.5668491 -0.1866912 0.0116321 -0.1726347 0.266642 -0.0003645 0.28334 -0.0841833 0.1612475 1.1765629 -0.7876785 0.0657382 -0.7747838 0.9528645 0.3094495 -0.2899444 0.7268768 1.2099187 1.1972639 0.7746429 -0.4408038 0.353402 1.3570932 0.2500983 -0.5980735 -0.0451369 0.665935 1.4067138 -0.6545317 -0.1155118 -0.8138744 0.6479349 0.0337562 -0.5857607 0.2424962 1.2629772 -0.3063153 0.1760702 -0.1685855 0.0868843 -0.0339655 0.0168687 -0.1806394 0.0540416 -0.1142473 -0.0170418 -0.0012889 0.0238276 -0.0339022 -0.3367606 -0.1568161 0.0154649 -0.2395339 -0.1124616 -0.1911489 0.1267441 -0.1412729 0.1363071 -0.0468404 0.079153 -0.1987657 0.1359362 -0.2031871 0.0424122 0.0206219 0.0390742 -0.05864 0.0140231 0.0087484 -0.0672082 0.0443482 0.0046857 0.0768519 0.0045097 0.0073529 0.0128348 0.1100484 -0.0377516 -0.0785672 0.0432869 -0.0066486 -0.0042217 0.0042919 -0.007294 0.0386311 -0.1018651 -0.0177384 -0.0545446 -0.0442466 0.0923843 0.0933564 -0.0244349 0.0785408 0.0276907 0.1076882 0.0479764 0.0491569 0.0485116 -0.0304909 0.0787425 0.0702482 0.0086764 0.0958079 -0.013812 -0.0510543 0.0226617 -0.0853674 0.0532999 0.0495257 -0.0597451 -0.0244406 -0.0866913 0.0077769 0.0068426 -0.0044591 0.0015416 0.1266034 -0.0386004 0.0711069 -0.0267274 0.0417997 0.0779585 -0.0117892 -0.0260614 0.0246619 0.1329458 0.0210997 -0.0952655 0.0605574 -0.0653173 0.0165745 0.0122054 0.0713734 0.0485951 0.0825675 0.1288677 -0.0148992 -0.0346541 0.0135212 0.0861335 0.0465136 -0.0355225 0.0228665 -0.0389977 0.043464 -0.0689393 0.077532 -0.0227666 0.0593679 0.0799112 0.0687184 0.0653082 0.0560683 0.0712299 -0.0306829 -0.0599404 -0.0694408 0.0070885 -0.0682432 -0.0521899 -0.0576409 0.0827037 0.0232893 0.0840327 0.0361102 0.1037446 0.0471621 -0.0295759 0.0662672 -0.063521 0.0449396 unknown
polarizability: 118.7237966|-16.3422152|107.3819661|-3.628025|5.8023451|93.6966007 unknown
InChI: InChI=1S/C8H12O6/c1-5(9)12-4-8(13-6(2)10)14-7(3)11/h8H,4H2,1-3H3
charge 0 multiplicity 1
26 atoms
O  -1.221931 1.166677 -0.574986
O  -0.321917 -1.012544 -0.439117
O  2.195053 0.13366 0.471224
O  -1.747425 2.189524 1.465966
O  -2.239512 -1.327434 0.862713
O  3.270945 -0.546936 -1.494441
C  -0.19559 0.341593 0.092446
C  1.177031 0.86565 -0.313454
C  -2.016718 1.993297 0.26611
C  -1.421729 -1.773983 0.035187
C  3.190747 -0.559885 -0.24955
C  -3.174791 2.557033 -0.517928
C  -1.426584 -3.130382 -0.625078
C  4.114462 -1.26791 0.714961
H  -0.370033 0.359603 1.183204
H  1.355801 0.72368 -1.392978
H  1.257367 1.930334 -0.039004
H  -2.85822 2.843439 -1.533616
H  -3.601086 3.420275 0.013368
H  -3.953336 1.778804 -0.617656
H  -0.4370 -3.608157 -0.531519
H  -2.200403 -3.763879 -0.168828
H  -1.632332 -3.016687 -1.704291
H  3.532527 -1.875697 1.427635
H  4.681771 -0.525143 1.303211
H  4.815903 -1.904033 0.156621
