program: Gaussian 09
title: 000075615
version: EM64L-G09RevD.01
frameworkgroup: C1[X(C8H11NO6S2)]
method: RPBEPBE
basis: SDD
operation: Freq
keyword: #p
keyword: freq=noraman
keyword: PBEPBE/SDD
title: #p freq=noraman PBEPBE/SDD
converged: NO YES NO NO
title: Mulliken charges:
elementType: S S O O O O O O N C C C C C C C C H H H H H H H H H H H
charge: 0.874622 1.191579 -0.389573 -0.600255 -0.516017 -0.545246 -0.497335 -0.469280 -0.682495 -0.501933 -0.067876 -0.290822 -0.243060 -0.203235 -0.384013 -0.386173 0.514347 0.261135 0.287593 0.293235 0.253829 0.286006 0.287845 0.236978 0.237811 0.320401 0.320893 0.411038
chargesum: 0.00000
title: Mulliken charges with hydrogens summed into heavy atoms:
elementType: S S O O O O O O N C C C C C C C C
charge: 0.874622 1.191579 -0.389573 -0.600255 -0.516017 -0.134208 -0.497335 -0.469280 -0.041201 0.046795 -0.067876 0.256242 0.042946 0.084610 -0.147035 -0.148362 0.514347
polarizability: 2.70615818e+02 1.20523328e+00 1.51467665e+02 -3.03387893e+00 -5.36994158e+00 1.08015755e+02
1716.lowfreq: -7.8863 -1.4735 -0.0013 -0.0013 0.0009 10.6213 25.8243 33.9439 43.2174
frequency: 25.7024 33.9386 43.1514 49.6673 81.6170 123.0156 130.0598 144.3559 164.5814 204.6777 221.2365 235.7098 249.5582 287.5949 289.5922 309.1661 334.5984 345.9654 371.0715 375.6221 403.4473 411.0792 420.5477 421.9819 456.9118 459.3548 500.4078 516.6820 539.7042 613.0067 621.7531 645.0911 708.9075 750.6080 807.5526 818.4298 822.0921 836.3290 859.9383 886.2350 908.4946 926.0706 953.7853 965.3245 970.8543 980.2449 996.3908 1022.4784 1048.6337 1050.4513 1133.0859 1155.5892 1185.5727 1203.7564 1262.5504 1300.6958 1327.3935 1336.5732 1378.2207 1399.2152 1400.6210 1436.9424 1445.6813 1490.7259 1581.9707 1614.1176 1651.3479 2147.9260 2951.5162 3015.5797 3048.8468 3137.8442 3140.0394 3144.2558 3159.6453 3168.3401 3559.3255 3697.1448
redmass: 9.4880 4.9565 6.6751 7.5881 7.0476 6.5922 9.3414 7.6550 6.3481 9.2860 5.6159 4.4838 5.9203 5.3972 5.5677 7.2291 5.8396 12.3192 4.2099 5.0711 5.2225 3.0130 3.7039 1.1023 3.6863 1.3733 3.4121 5.0871 5.0215 7.6296 6.9610 14.2076 3.0033 10.9343 4.7606 1.2558 2.6051 1.8577 15.3640 7.0890 1.0788 1.8204 1.3325 1.3461 3.0593 4.7420 15.5306 1.4396 2.8043 2.6582 1.1931 1.1952 1.1178 1.1288 1.1877 1.2976 2.5415 1.2387 1.1096 2.0976 1.5275 3.9936 1.0610 2.9831 7.3021 4.8005 1.2245 1.0898 1.0599 1.1000 1.0577 1.0885 1.0892 1.1097 1.0966 1.0964 1.0455 1.1040
irintensity: 0.2207 0.6337 0.9667 2.2585 1.6336 14.2159 2.5753 3.3793 0.4683 0.9099 3.0600 5.2499 4.6072 4.9596 28.0097 9.2830 3.9319 11.5457 40.6961 23.5750 6.2661 2.3293 16.0353 1.8813 55.8637 354.7830 19.4620 29.8165 95.4713 11.8010 1.5947 79.4604 5.7154 245.3191 14.8774 0.4066 4.4346 79.6828 97.1281 40.0901 172.2105 60.0664 1.7543 0.3424 88.0661 2.8687 138.2101 3.9267 80.9279 12.6931 12.2709 3.0079 60.6247 5.5043 5.7672 4.5658 81.0433 6.1043 16.1638 9.3216 47.8892 2.5637 23.6335 78.4450 9.6972 197.8786 295.4150 3218.8135 18.1439 4.0258 8.2998 9.2362 9.1295 0.3874 6.5992 8.2049 133.1164 28.8241
temp: 298.150 k
press: 1.00000 atm
elementType: 16 16 8 8 8 8 8 8 7 6 6 6 6 6 6 6 6 1 1 1 1 1 1 1 1 1 1 1
symmnumber: 1
zpe: 501344.1 jmol-1
zpe.correction: 0.190952 hartree
zpe.thermalcorrener: 0.209359 hartree
zpe.thermalcorrenthalpy: 0.210303 hartree
zpe.thermalcorrgfe: 0.143262 hartree
zpe.sumelectzpe: -1612.021433 hartree
zpe.sumelectthermal: -1612.003026 hartree
zpe.sumelectthermalent: -1612.002082 hartree
zpe.sumelectthermalfe: -1612.069123 hartree
dipole: -14.5458 1.4854 4.8069
dipole: 15.3913
quadrupole: -95.9354 -113.8506 -120.9074
quadrupole: 11.7684 0.6050 4.8231
quadrupole: 14.2958 -3.6195 -10.6763 11.7684 0.6050 4.8231
hfenergy: -1612.212385 hartree
pointgroup: C01 [X(C8H11N1O6S2)]
dipole: -5.726558 0.2291097 1.9550042 debye
polarizability: 270.6602895|0.0930439|151.5995254|-2.0741277|4.7113502|107.8394233 unknown
InChI: InChI=1S/C8H11NO6S2/c9-7-1-3-8(4-2-7)16(10,11)6-5-15-17(12,13)14/h1-4,12H,5-6,9H2
charge 0 multiplicity 1
28 atoms
S  0.14788 0.461291 -0.230094
S  4.184554 -0.431644 -0.220898
O  3.085389 -0.504678 1.351629
O  0.778062 -0.869407 -1.016621
O  0.373723 1.968651 -0.810091
O  3.219129 -1.408929 -1.288622
O  4.21418 1.122362 -0.661703
O  5.51998 -1.227851 0.132059
N  -5.788053 -0.647526 0.043015
C  0.844405 0.455305 1.5978
C  -1.672299 0.099914 -0.111095
C  2.345003 0.729192 1.628626
C  -2.554352 1.197754 -0.101226
C  -2.111602 -1.23784 -0.105726
C  -3.934256 0.943613 -0.046787
C  -3.492888 -1.484364 -0.049959
C  -4.425713 -0.39969 -0.012604
H  0.25131 1.253813 2.074428
H  0.581968 -0.541442 1.985028
H  2.636002 1.542897 0.928531
H  2.619528 1.053698 2.652179
H  -2.167892 2.220614 -0.165057
H  -1.391992 -2.059408 -0.177263
H  -4.640031 1.781736 -0.041585
H  -3.85874 -2.517206 -0.047821
H  -6.459629 0.115456 0.050064
H  -6.147571 -1.598286 0.047385
H  2.176104 -1.128827 -1.192393
