program: Gaussian 09
title: 000004501
version: EM64L-G09RevD.01
frameworkgroup: C1[X(C21H18NO4)]
method: RPBEPBE
basis: SDD
operation: Freq
keyword: #p
keyword: freq=noraman
keyword: PBEPBE/SDD
title: #p freq=noraman PBEPBE/SDD
converged: YES YES NO NO
title: Mulliken charges:
elementType: O O O O N C C C C C C C C C C C C C C C C C C C C C H H H H H H H H H H H H H H H H H H
charge: -0.242767 -0.233554 -0.264803 -0.285373 -0.143572 0.093337 0.274887 0.272628 0.306702 0.444384 0.426750 -0.390448 -0.402867 -0.415184 -0.490297 -0.542421 0.144990 -0.492205 0.189447 -0.540923 -0.647913 0.219467 0.205102 -0.202063 -0.527678 -0.525676 0.281878 0.242972 0.270399 0.265266 0.285893 0.266346 0.273089 0.265962 0.296504 0.263363 0.265246 0.264845 0.271496 0.256907 0.246970 0.259242 0.240344 0.253328
chargesum: 1.00000
title: Mulliken charges with hydrogens summed into heavy atoms:
elementType: O O O O N C C C C C C C C C C C C C C C C C C C C C
charge: -0.242767 -0.233554 -0.264803 -0.285373 -0.143572 0.093337 0.274887 0.272628 0.306702 0.444384 0.426750 -0.108571 -0.159895 -0.144785 -0.225031 -0.256528 0.144990 -0.225859 0.189447 -0.267835 0.177916 0.219467 0.205102 0.328028 0.247696 0.227238
polarizability: 5.82144206e+02 6.52177803e+00 2.49042679e+02 2.59127591e+00 2.08554312e+00 1.19194826e+02
1716.lowfreq: -0.0006 0.0004 0.0005 2.2400 6.8050 11.8290 28.9709 43.3047 66.0671
frequency: 28.9482 43.3022 66.0611 75.2224 84.0175 97.9195 110.4835 123.3161 138.5720 149.6697 155.5710 170.3788 180.3732 205.8339 223.1680 245.9626 272.6926 276.9175 283.8289 314.8601 334.5306 339.6194 349.5313 366.0031 400.1320 419.1082 429.5803 455.0366 470.1667 484.1380 497.3896 523.5792 550.7816 578.6614 591.8563 632.6310 656.4536 657.3145 678.2772 691.7970 697.0245 721.7485 728.1357 737.2324 746.1309 778.1490 792.1895 799.5480 827.9115 833.3047 858.6510 871.6179 885.1484 887.4240 896.9103 910.5869 924.4359 943.0168 966.4917 972.2579 980.9841 1016.3106 1061.5306 1069.4895 1101.6835 1110.2578 1111.9691 1114.6648 1120.9955 1126.0726 1136.6082 1149.0318 1161.9333 1189.4560 1209.2492 1219.6262 1239.6249 1254.3664 1259.9248 1283.7147 1305.2614 1323.8927 1358.1985 1366.0331 1376.3877 1395.0356 1408.3860 1415.1230 1433.0847 1436.3195 1444.9550 1450.7294 1459.6482 1465.1827 1470.0914 1470.8309 1483.0261 1483.8938 1486.8389 1491.7924 1498.4494 1508.5789 1535.3410 1563.9040 1602.9747 1622.9098 1624.6004 1635.1649 2991.1959 3006.0457 3021.9559 3044.0236 3092.2666 3114.0975 3120.0744 3133.5331 3147.3658 3150.7051 3152.0146 3155.3055 3158.8986 3171.7329 3179.1576 3180.6732 3190.2401 3227.5305
redmass: 5.4136 4.2201 3.4155 4.9419 2.5481 4.5636 1.5535 4.4057 2.1555 2.1936 1.1531 4.0903 4.8630 5.9166 4.8763 4.3486 3.8053 1.8235 2.3768 4.8606 5.7253 4.9965 5.7885 4.1178 3.5343 5.0157 5.8655 4.4887 3.9165 3.7788 5.5034 5.9092 4.4981 5.6821 4.6230 6.4887 6.4293 5.1186 7.9698 7.3860 7.0369 5.2886 4.8025 6.5294 2.7197 3.6225 5.7774 5.7587 1.6452 7.8476 1.5670 1.4681 1.5796 4.3544 1.7067 5.0525 1.6830 5.6789 5.0365 4.3889 1.4643 3.5350 1.4496 4.1198 1.7499 1.3469 1.2481 1.3257 1.0373 2.0598 2.3379 1.3352 1.9060 1.8400 1.4566 2.0755 1.5268 1.8870 1.9051 5.1019 4.0156 2.5143 1.8512 2.0768 3.7751 2.2064 2.5135 5.9638 1.3829 1.2143 2.9978 1.5848 1.0556 1.0888 1.8702 1.0826 1.2276 1.1385 1.1637 1.9184 1.7745 4.6821 4.3218 5.3231 7.6862 7.6988 6.3267 7.8081 1.0302 1.0300 1.0348 1.0539 1.1059 1.1046 1.1033 1.1197 1.1034 1.0901 1.1026 1.1056 1.0929 1.0939 1.0948 1.0940 1.0917 1.0907
irintensity: 0.1286 0.5769 1.6638 1.1416 19.6236 2.6038 7.7976 3.2878 1.3198 5.7713 1.6246 2.1425 1.7540 14.9692 3.1287 6.1302 9.0518 4.9530 8.0708 3.3232 7.1933 1.9866 1.5153 8.2511 1.5058 4.1633 22.8452 3.5445 3.8600 2.5937 3.6942 3.9327 9.0117 3.7897 3.5445 5.3822 2.2183 6.4604 7.2073 1.9712 0.3692 2.4499 27.7872 6.7083 15.0032 4.1544 3.5751 16.8838 6.7633 33.4993 23.6358 7.0238 40.5884 25.7286 33.3436 30.1433 57.6355 73.7461 232.5686 77.0057 4.3073 18.9253 4.7781 15.5804 4.3781 25.3748 84.3035 0.2890 0.0263 30.1290 21.6458 0.6254 35.9371 180.1961 26.8643 134.2859 1.8823 214.3650 8.8045 62.3819 503.1930 31.6833 16.9753 44.5601 35.1339 15.8822 6.7909 85.6970 1.0434 21.2402 12.3778 16.4360 17.9938 1.7450 294.1321 15.3405 1.8418 145.7946 110.4990 411.3294 116.2973 34.1214 3.9653 7.6936 42.2336 27.7215 142.1880 35.4988 52.3562 67.3435 12.2417 91.4947 20.7901 13.8256 8.0158 11.8519 12.3700 1.7668 1.3274 6.5050 1.2999 2.4726 0.9402 1.3212 2.2456 3.0900
temp: 298.150 k
press: 1.00000 atm
elementType: 8 8 8 8 7 6 6 6 6 6 6 6 6 6 6 6 6 6 6 6 6 6 6 6 6 6 1 1 1 1 1 1 1 1 1 1 1 1 1 1 1 1 1 1
symmnumber: 1
zpe: 899607.0 jmol-1
zpe.correction: 0.342642 hartree
zpe.thermalcorrener: 0.364864 hartree
zpe.thermalcorrenthalpy: 0.365808 hartree
zpe.thermalcorrgfe: 0.291712 hartree
zpe.sumelectzpe: -1164.602610 hartree
zpe.sumelectthermal: -1164.580388 hartree
zpe.sumelectthermalent: -1164.579444 hartree
zpe.sumelectthermalfe: -1164.653540 hartree
dipole: -1.1853 2.8773 -0.6092
dipole: 3.1709
quadrupole: -41.8841 -118.7465 -144.7537
quadrupole: 6.8742 -2.2838 -0.1234
quadrupole: 59.9107 -16.9517 -42.9589 6.8742 -2.2838 -0.1234
hfenergy: -1164.9452521 hartree
pointgroup: C01 [X(C21H18N1O4)]
dipole: -0.4841331 -1.1180628 0.2681896 debye
polarizability: 581.5758758|-13.051843|249.4574367|-9.6038403|-0.083163|119.3483987 unknown
InChI: InChI=1S/C21H18NO4/c1-22-10-13-7-17(23-2)18(24-3)8-15(13)14-5-4-12-6-19-20(26-11-25-19)9-16(12)21(14)22/h4-10H,11H2,1-3H3
charge 1 multiplicity 1
44 atoms
O  5.641526 -1.403388 -0.644803
O  6.253211 0.905087 -0.41431
O  -4.986406 1.811711 -0.102037
O  -5.709177 -1.057558 -0.181552
N  0.328683 -1.758532 0.527165
C  0.773383 -0.428779 0.259055
C  -0.236307 0.596883 0.191129
C  2.178238 -0.102092 0.068089
C  -1.649422 0.248741 0.147347
C  2.549732 1.304949 0.103831
C  -2.011385 -1.148836 0.220991
C  -0.990785 -2.089885 0.465265
C  0.185063 1.967537 0.169277
C  3.207042 -1.070506 -0.224543
C  1.526421 2.306702 0.188099
C  3.918284 1.722281 -0.022289
C  4.512047 -0.626008 -0.355563
C  -2.699045 1.197578 0.047305
C  4.875063 0.746451 -0.23185
C  -3.378051 -1.557736 0.10903
C  1.228447 -2.825491 1.077003
C  -4.046772 0.798753 -0.010713
C  -4.389433 -0.613767 -0.047222
C  6.796626 -0.455985 -0.694714
C  -6.185851 1.778028 0.789467
C  -6.367244 -0.738892 -1.482901
H  -1.236007 -3.136266 0.664438
H  -0.564052 2.761409 0.155254
H  2.995712 -2.120128 -0.415759
H  1.825136 3.359681 0.213599
H  4.178811 2.782622 0.016156
H  -2.512344 2.273343 0.034908
H  -3.650701 -2.618059 0.11688
H  1.604258 -3.48428 0.277976
H  2.070118 -2.365676 1.610744
H  0.649547 -3.4271 1.794005
H  7.227011 -0.469008 -1.708437
H  7.515581 -0.725942 0.094531
H  -6.643713 0.776813 0.814953
H  -6.873147 2.521572 0.363398
H  -5.872602 2.084552 1.802217
H  -7.401405 -1.093238 -1.372914
H  -5.860118 -1.288493 -2.29538
H  -6.347274 0.346254 -1.686727
