program: Gaussian 09
title: 000075581
version: EM64L-G09RevD.01
frameworkgroup: C1[X(C10H8)]
method: RPBEPBE
basis: SDD
operation: Freq
keyword: #p
keyword: freq=noraman
keyword: PBEPBE/SDD
title: #p freq=noraman PBEPBE/SDD
converged: NO NO NO NO
title: Mulliken charges:
elementType: C C C C C C C C C C H H H H H H H H
charge: 0.105783 0.327724 0.474255 -0.407872 -0.423507 -0.364377 -0.416795 -0.240394 -0.229863 -0.716665 0.250198 0.247807 0.233745 0.244721 0.225305 0.225150 0.238232 0.226553
chargesum: 0.00000
title: Mulliken charges with hydrogens summed into heavy atoms:
elementType: C C C C C C C C C C
charge: 0.105783 0.327724 0.474255 -0.157674 -0.175700 -0.130632 -0.172075 -0.015089 -0.004713 -0.251880
polarizability: 1.60618903e+02 1.17994766e+01 1.20773316e+02 -9.75379278e-04 2.33721034e-03 4.11450634e+01
1716.lowfreq: -12.8779 -0.0007 -0.0006 0.0004 5.5450 12.9216 137.6391 198.4777 246.6770
frequency: 137.6363 198.4763 246.6765 317.6470 407.2439 445.4801 524.6489 546.6015 557.4163 651.7515 662.3977 707.1058 737.9802 765.9395 785.9414 813.3547 849.1462 884.9457 933.7238 939.1819 948.9236 963.3087 983.6141 1016.3945 1069.3830 1085.4565 1126.4766 1168.9878 1202.6162 1229.6877 1301.2497 1331.6563 1401.8175 1431.6784 1449.7064 1459.4828 1527.7859 1596.5167 1616.3957 1654.8477 3097.6891 3121.4042 3129.8785 3143.1759 3161.5482 3170.5315 3199.4530 3200.3561
redmass: 3.4927 3.8471 2.9942 3.4114 2.7118 3.0433 5.5863 2.4668 6.1445 1.6461 1.8667 5.8348 4.8420 1.3728 2.0087 1.5747 4.9498 1.4980 1.7841 1.3382 1.4405 1.4338 1.3316 2.2941 1.5361 1.8336 1.6138 1.1180 2.1101 1.7640 1.7212 2.5257 3.3675 1.5205 2.3738 2.6815 5.0093 6.6398 7.3379 5.7819 1.0614 1.0856 1.0892 1.0946 1.1002 1.0883 1.1061 1.1144
irintensity: 1.1706 5.2874 0.0926 4.1270 5.7974 1.3609 0.0109 7.4782 0.8381 6.8015 0.5457 0.7117 0.6447 73.5562 27.2355 30.6275 1.1944 2.5178 3.8266 2.8723 13.1166 69.1050 0.0168 6.3403 8.0769 4.2071 0.2075 1.1817 3.2670 4.5909 4.2518 5.9815 5.8502 0.0616 7.8390 43.4159 1.7625 0.5639 7.3760 1.7985 4.9917 2.3951 3.7310 32.0026 33.5281 2.0796 11.6755 12.5845
temp: 298.150 k
press: 1.00000 atm
elementType: 6 6 6 6 6 6 6 6 6 6 1 1 1 1 1 1 1 1
symmnumber: 1
zpe: 376245.4 jmol-1
zpe.correction: 0.143304 hartree
zpe.thermalcorrener: 0.150690 hartree
zpe.thermalcorrenthalpy: 0.151634 hartree
zpe.thermalcorrgfe: 0.111530 hartree
zpe.sumelectzpe: -385.159630 hartree
zpe.sumelectthermal: -385.152244 hartree
zpe.sumelectthermalent: -385.151300 hartree
zpe.sumelectthermalfe: -385.191404 hartree
dipole: -0.3490 -0.2209 0.0003
dipole: 0.4130
quadrupole: -49.5386 -49.8097 -64.6078
quadrupole: 0.7467 -0.0002 0.0005
quadrupole: 5.1134 4.8424 -9.9558 0.7467 -0.0002 0.0005
hfenergy: -385.302934 hartree
pointgroup: C01 [X(C10H8)]
dipole: 0.1341645 0.0916624 0.000128 debye
dipolederiv: 0.0718417 0.208936 -0.0000057 0.2484342 -0.1445153 0.0000258 0.0000413 0.0000886 -0.031494 0.2991006 0.1296441 0.0000192 -0.2753146 -0.1915227 -0.0000126 0.0001333 -0.0000452 0.0279692 0.1075161 -0.134341 -0.0000137 -0.1025557 0.0525829 -0.0000117 0.0000029 -0.0000291 0.0746396 -0.1029936 -0.2341005 0.0000451 -0.0875056 0.1315107 -0.0000134 -0.0000106 -0.000017 -0.1824956 -0.123671 0.0803249 0.000016 0.1453691 0.0782792 -0.000027 -0.0001201 -0.0000243 -0.2178354 -0.0972186 -0.05708 -0.0000218 0.0147714 0.155945 -0.0000024 -0.0000307 -0.0000127 -0.1372605 -0.2347942 -0.0564226 -0.0000248 0.1497071 0.1592831 -0.000007 -0.0000587 0.0000097 -0.1769697 0.0367796 0.0024942 -0.0000314 0.0011284 0.0559439 0.000021 -0.0000217 -0.0000142 -0.1763449 0.1540163 0.0358841 -0.0000273 -0.0722668 -0.1299371 0.0000041 -0.0000223 0.0000077 -0.1642086 -0.0360361 -0.0696443 0.0001154 -0.1509052 -0.0276502 -0.0000706 0.0000976 -0.0000443 -0.3713529 0.0760191 -0.014997 -0.0000077 0.044726 -0.0914473 0.0000084 -0.0000133 0.0000177 0.1721054 -0.066236 0.0807836 -0.0000285 0.0249225 0.0654228 0.0000149 0.0000247 0.0000052 0.1812649 0.0623805 -0.0872612 0.0000091 -0.0243485 -0.0871966 0.000005 0.000011 0.0000031 0.149493 0.0684337 -0.0373239 0.0000076 -0.0704462 -0.1024945 0.000006 0.00002 0.0000073 0.1636486 -0.0317207 0.1049266 0.0000132 0.121861 -0.0241634 -0.0000115 0.0000169 -0.0000003 0.1641456 -0.1425035 -0.0463374 0.0000219 -0.0475409 0.0793566 0.0000038 0.0000235 -0.0000029 0.1611504 -0.0883595 0.0039098 -0.0000516 0.0419263 0.0761192 0.0000284 -0.0000585 0.0000128 0.1874826 0.0474456 0.0906044 -0.0000349 0.0380374 -0.0555162 0.000039 -0.0000353 0.000038 0.1760623 unknown
polarizability: 159.742307|13.1676761|121.6499118|0.0010568|-0.0023015|41.1450634 unknown
InChI: InChI=1S/C10H8/c1-8-6-7-9-4-2-3-5-10(8)9/h2-7H,1H2
charge 0 multiplicity 1
18 atoms
C  0.168666 0.445298 0.000011
C  -0.248064 -0.926831 0.000078
C  1.661213 0.458607 0.000223
C  0.964379 -1.773738 0.000305
C  2.080996 -0.96376 0.000448
C  -0.782157 1.480428 0.000153
C  -1.616133 -1.263399 0.000216
C  -2.160964 1.141355 0.000271
C  -2.572148 -0.21456 0.0003
C  2.486185 1.547522 0.000224
H  0.952479 -2.866302 0.000349
H  3.123621 -1.288787 0.000589
H  -0.476788 2.533565 0.000159
H  -1.940395 -2.310035 0.000271
H  -2.916438 1.935045 0.000347
H  -3.642069 -0.451712 0.000395
H  3.576237 1.437573 0.00046
H  2.094279 2.571031 0.000001
