program: Gaussian 09
title: 000075582
version: EM64L-G09RevD.01
frameworkgroup: C1[X(C11H12O2)]
method: RPBEPBE
basis: SDD
operation: Freq
keyword: #pfreq=noraman
keyword: PBEPBE/SDD
title: #p freq=noraman PBEPBE/SDD
converged: YES YES NO NO
title: Mulliken charges:
elementType: O O C C C C C C C C C C C H H H H H H H H H H H H
charge: -0.206086 -0.269153 -0.567900 0.392466 0.346361 -0.510115 -0.675930 0.194208 -0.587791 -0.429208 0.344827 -0.378175 -0.537217 0.216435 0.232355 0.249384 0.251545 0.259646 0.246217 0.262833 0.236334 0.242774 0.220658 0.220570 0.244961
chargesum: 0.00000
title: Mulliken charges with hydrogens summed into heavy atoms:
elementType: O O C C C C C C C C C C C
charge: -0.206086 -0.269153 -0.119110 0.392466 0.346361 -0.009186 -0.170066 0.194208 -0.324958 -0.192874 0.344827 -0.135400 0.148972
polarizability: 1.74909956e+02 7.46988390e-01 1.18642855e+02 -3.95329262e+00 -5.99608741e-03 7.08080153e+01
1716.lowfreq: -9.0295 -6.2473 -0.0006 -0.0004 0.0004 8.1834 31.2928 78.4476 128.1588
frequency: 31.1826 78.4396 128.1575 136.6894 191.1911 232.8130 251.4720 297.4625 327.2486 343.4303 388.9459 451.3992 475.5270 488.9023 511.1025 539.6197 565.8496 626.6752 678.1880 724.4766 742.5211 793.2252 805.6310 852.9308 867.1673 892.5073 917.4342 937.5787 981.3004 1007.5093 1028.0593 1111.9926 1113.3733 1122.1526 1141.9223 1161.4552 1170.3337 1183.8894 1200.1533 1228.0268 1249.9297 1263.7137 1292.1135 1302.8689 1334.9920 1384.3975 1423.2209 1424.7215 1432.3472 1443.7961 1466.2484 1466.5360 1474.6392 1495.5122 1584.1389 1627.4385 1633.2105 2930.0346 2957.6808 2968.7906 2983.1682 3044.7622 3053.2905 3059.5741 3060.8939 3123.9446 3125.4969 3149.0588 3164.8190
redmass: 6.2995 3.0948 3.3123 2.8822 3.4589 1.2225 2.1787 3.2280 3.1839 5.5610 3.3003 3.0498 4.4826 3.4690 3.9810 2.7160 4.5663 3.1630 3.3913 5.3649 2.8303 3.0784 1.4832 2.3240 1.9924 1.5455 3.2076 1.3700 2.5625 3.1105 2.3693 1.2600 1.4444 1.5049 1.5712 2.2886 1.3832 1.3815 2.1188 1.5722 1.8251 2.3605 1.4167 1.6142 1.6078 5.5849 1.2615 1.1168 1.3645 1.9222 1.1275 1.0511 1.0889 2.6221 7.1231 8.6997 8.5492 1.0687 1.0331 1.0679 1.0632 1.1039 1.0942 1.0907 1.0957 1.0960 1.0925 1.0919 1.0940
irintensity: 4.5962 10.6463 2.4216 0.6675 2.1801 0.6330 0.4079 2.6902 4.1472 2.8674 7.5152 11.9100 1.0581 3.7880 1.5878 2.6530 14.6668 4.3602 3.1818 3.1849 2.0788 4.6953 33.6899 0.1671 3.5856 34.1906 1.2077 1.4379 35.5463 28.1041 7.8962 0.2250 4.0864 31.3881 17.2566 65.1027 16.0893 25.5353 61.1310 16.3640 22.1218 75.3188 4.0578 0.6365 7.7761 6.5051 20.6800 9.7402 32.5027 14.3896 12.6164 14.9932 38.6348 98.0931 30.4390 45.2969 211.4599 22.3524 69.1948 23.8632 15.2341 50.1304 27.5414 6.7919 16.8755 37.2345 1.7916 4.1993 13.6422
temp: 298.150 k
press: 1.00000 atm
elementType: 8 8 6 6 6 6 6 6 6 6 6 6 6 1 1 1 1 1 1 1 1 1 1 1 1
symmnumber: 1
zpe: 530240.4 jmol-1
zpe.correction: 0.201958 hartree
zpe.thermalcorrener: 0.213506 hartree
zpe.thermalcorrenthalpy: 0.214450 hartree
zpe.thermalcorrgfe: 0.163994 hartree
zpe.sumelectzpe: -575.858298 hartree
zpe.sumelectthermal: -575.846750 hartree
zpe.sumelectthermalent: -575.845806 hartree
zpe.sumelectthermalfe: -575.896262 hartree
dipole: 3.6758 -0.0202 0.8038
dipole: 3.7627
quadrupole: -82.9521 -71.0612 -77.8271
quadrupole: -11.6696 -6.4003 -0.7045
quadrupole: -5.6720 6.2190 -0.5470 -11.6696 -6.4003 -0.7045
hfenergy: -576.0602556 hartree
pointgroup: C01 [X(C11H12O2)]
dipole: 1.4283137 -0.0227237 0.3884267 debye
dipolederiv: -1.0383635 -0.1549904 -0.2136645 -0.1556723 -0.532902 -0.0290375 -0.2915475 -0.0338057 -0.4112468 -1.7901483 -0.0755162 0.0670263 -0.272993 -0.3399402 0.0096148 0.0752718 0.0019956 -0.3029424 0.005938 0.0645039 -0.0313718 0.0068626 0.1108656 -0.011569 0.0059713 -0.03692 0.1280038 0.2176501 -0.0289671 -0.0271427 -0.1680068 0.1828293 0.0176284 -0.0851254 0.0507321 -0.0626404 0.1425743 0.10962 0.0052983 0.2412258 -0.2190322 0.0136434 -0.0977428 -0.0440447 -0.0730838 -0.0053182 -0.0680962 -0.0309371 -0.0952182 -0.3716867 0.0666225 0.0389857 0.1218138 0.0757216 -0.2089802 0.094094 -0.1543054 0.2287675 -0.0951588 0.1689868 -0.1827885 0.1676351 -0.01508 1.1237221 0.0978124 0.36421 -0.0027009 0.856215 -0.1649668 0.4677048 -0.140537 0.3011171 -0.4516766 -0.0413567 0.0000434 0.1739401 0.0236957 0.0160646 0.0347699 0.0246378 -0.1778826 0.0976591 -0.0937104 -0.0442007 0.022875 0.1319207 0.0205374 0.0028097 0.0265221 -0.1345357 1.4478266 0.2426093 -0.0539736 0.5970598 0.1601418 -0.0242423 -0.0237876 -0.0146982 0.1036267 -0.2952153 0.0137243 -0.0055202 -0.3668689 -0.1254783 0.0359995 -0.024997 0.0151998 -0.2111947 0.7866727 -0.0771581 -0.0310647 -0.4100412 0.2728395 0.0159684 -0.0712039 0.0000815 0.3306827 -0.0302652 0.0553703 0.0748798 0.0262491 0.0706602 0.0292078 0.0613538 -0.0308192 -0.1168526 0.0207672 -0.1028488 -0.0083714 -0.0270122 -0.1353604 0.0047551 -0.0200415 0.0407948 0.0824748 0.0953216 -0.0514356 0.0554072 -0.0391881 0.0791297 -0.0204104 0.0100639 -0.0060908 -0.0716876 -0.1139568 0.1026231 -0.0104872 0.0704933 0.0182878 -0.012641 -0.0171157 -0.0393151 0.1004166 0.0180497 0.0121427 -0.0157059 -0.0340564 -0.0681698 -0.0468262 -0.0288033 -0.073767 0.0917492 -0.0614793 -0.0192708 0.0474835 -0.0051017 0.11466 -0.024915 0.1125836 0.0170294 -0.04413 0.0921807 -0.0136474 0.0021406 -0.0406126 -0.0572587 -0.0177499 -0.0052607 -0.0113584 0.1591514 0.063604 -0.0622388 -0.0009128 -0.0410374 -0.100914 -0.0217706 -0.0035207 -0.0232582 0.142504 -0.0413606 0.0933749 0.0210678 0.1035548 0.0307901 -0.0209271 0.0233458 -0.0236766 0.1669734 0.0195019 -0.0140861 -0.0451933 0.1473605 0.0034379 -0.1180475 0.0407508 -0.0978881 -0.1129578 0.0200061 -0.0069976 0.028523 0.1690025 -0.0398548 0.1150685 -0.0250364 0.1135907 -0.0702115 -0.1147103 -0.0755546 0.0067716 -0.1288815 0.0302825 -0.0009938 0.00336 -0.0038537 0.1220247 unknown
polarizability: 175.0315513|1.0094707|118.4740676|1.3972052|2.9339805|70.8552079 unknown
InChI: InChI=1S/C11H12O2/c1-13-11-5-3-8-6-10(12)4-2-9(8)7-11/h3,5,7H,2,4,6H2,1H3
charge 0 multiplicity 1
25 atoms
O  -4.073059 -0.675511 -0.89806
O  3.448192 0.745101 -0.012095
C  -1.409045 1.599816 0.382569
C  -0.23171 0.648295 0.231923
C  -0.517464 -0.744355 0.118088
C  -2.548421 1.209276 -0.591284
C  -1.962414 -1.204743 0.20919
C  -2.964024 -0.259466 -0.472733
C  1.099883 1.09949 0.179439
C  0.549407 -1.650778 -0.050706
C  2.163911 0.176279 0.021383
C  1.892496 -1.208463 -0.097461
C  4.584648 -0.163333 -0.176324
H  -1.794285 1.561433 1.422908
H  -1.096258 2.643271 0.200816
H  -2.208217 1.362113 -1.636393
H  -3.448437 1.836295 -0.458717
H  -2.11064 -2.222435 -0.19175
H  -2.278915 -1.249042 1.276845
H  1.340455 2.164999 0.256499
H  0.338044 -2.722536 -0.147205
H  2.69795 -1.936669 -0.229414
H  4.527457 -0.71203 -1.136851
H  4.646821 -0.88682 0.660116
H  5.473425 0.484614 -0.172481
