program: Gaussian 09
title: 000075545
version: EM64L-G09RevD.01
frameworkgroup: C1[X(C2H2Cl4Si)]
method: RPBEPBE
basis: SDD
operation: Freq
keyword: #p
keyword: freq=noraman
keyword: PBEPBE/SDD
title: #p freq=noraman PBEPBE/SDD
converged: NO NO NO NO
title: Mulliken charges:
elementType: Cl Cl Cl Cl Si C C H H
charge: -0.218532 -0.216084 -0.218710 0.008526 0.902144 -0.344363 -0.432506 0.266993 0.252532
chargesum: 0.00000
title: Mulliken charges with hydrogens summed into heavy atoms:
elementType: Cl Cl Cl Cl Si C C
charge: -0.218532 -0.216084 -0.218710 0.008526 0.902144 -0.344363 0.087020
polarizability: 8.14570318e+01 8.93687936e+00 9.19564560e+01 4.43458308e-03 -2.95420936e-03 6.50676528e+01
1716.lowfreq: -42.4978 -6.7847 -0.0020 -0.0019 0.0012 9.0111 11.2366 97.9548 109.2001
frequency: -42.4965 97.9539 109.1994 142.0140 159.2426 166.7970 249.7199 304.1766 396.1427 404.3962 528.5138 530.1044 546.5292 657.0029 757.3937 937.3745 1084.8712 1395.2080 1596.1463 3100.8264 3209.7373
redmass: 6.8898 13.4519 18.2723 23.9826 17.9161 13.5987 17.0719 5.0961 6.2422 6.7079 15.7581 22.2940 17.8088 1.0489 3.2130 1.3274 1.9413 1.1884 4.8197 1.0627 1.1152
irintensity: 1.3294 0.0303 0.6360 2.4862 2.3188 10.8858 4.1827 0.5968 29.2117 2.1362 109.7465 171.7819 79.6699 0.9153 35.3514 67.0427 29.0156 21.8013 17.2203 1.3771 0.3620
temp: 298.150 k
press: 1.00000 atm
elementType: 17 17 17 17 14 6 6 1 1
symmnumber: 1
zpe: 97934.4 jmol-1
zpe.correction: 0.037301 hartree
zpe.thermalcorrener: 0.045914 hartree
zpe.thermalcorrenthalpy: 0.046859 hartree
zpe.thermalcorrgfe: 0.001855 hartree
zpe.sumelectzpe: -2206.577146 hartree
zpe.sumelectthermal: -2206.568533 hartree
zpe.sumelectthermalent: -2206.567589 hartree
zpe.sumelectthermalfe: -2206.612593 hartree
dipole: 1.5010 -2.4315 -0.0006
dipole: 2.8575
quadrupole: -78.6171 -72.2780 -80.6454
quadrupole: -3.3944 0.0022 -0.0017
quadrupole: -1.4369 4.9022 -3.4652 -3.3944 0.0022 -0.0017
hfenergy: -2206.6144477 hartree
pointgroup: C01 [X(C2H2Cl4Si1)]
dipole: -0.8701699 -0.7118095 -0.0015225 debye
dipolederiv: -0.4663282 0.0440519 0.1481437 0.0993548 -0.3732602 -0.1813844 0.2030232 -0.1535022 -0.6460887 -0.3503789 -0.0990613 -0.0004546 -0.1399622 -0.7258432 -0.0022822 -0.0004805 -0.0020492 -0.3031698 -0.4656033 0.0451038 -0.1472709 0.1008603 -0.3761561 0.1838645 -0.2016328 0.1558023 -0.6439747 -0.3974782 0.360308 -0.0007206 0.2067862 -0.4565146 0.0003105 -0.0008583 0.0009632 -0.0087146 1.64903 0.1193687 -0.0002843 0.0625503 1.681722 0.0000405 -0.0006135 0.0001692 1.8745114 0.1538761 -0.4098642 0.0011692 -0.5242028 0.3316048 -0.0008894 0.0009994 -0.0011313 -0.4261959 -0.18401 -0.1072769 0.000263 0.1263925 -0.2484938 0.000186 0.0003712 -0.0006571 -0.2371846 -0.0070057 -0.0088356 -0.0005316 -0.0364836 0.1061256 -0.0001038 -0.0005365 0.0000956 0.2257844 0.0678983 0.0562056 -0.0003138 0.1047043 0.0608156 0.0002584 -0.0002722 0.0003095 0.1650325 unknown
polarizability: 77.0639988|-3.8007795|96.3494304|0.0262774|0.0021226|65.0677115 unknown
InChI: InChI=1S/C2H2Cl4Si/c1-2(3)7(4,5)6/h1H2
charge 0 multiplicity 1
9 atoms
Cl 1.617403 -0.856856 -1.750194
Cl 1.191056 2.176932 0.011178
Cl 1.613307 -0.872524 1.74694
Cl -2.215456 1.251859 -0.003788
Si 0.724819 0.068681 0.001508
C  -1.148796 -0.224595 -0.001676
C  -1.695405 -1.46244 -0.003505
H  -2.779323 -1.620068 -0.006061
H  -1.058204 -2.354889 -0.001803
