program: Gaussian 09
title: 000075538
version: EM64L-G09RevD.01
frameworkgroup: C1[X(C9H21N)]
method: RPBEPBE
basis: SDD
operation: Freq
keyword: #pfreq=noraman
keyword: PBEPBE/SDD
title: #p freq=noraman PBEPBE/SDD
converged: YES YES NO NO
title: Mulliken charges:
elementType: N C C C C C C C C C H H H H H H H H H H H H H H H H H H H H H
charge: -0.293243 -0.376189 -0.369957 -0.371477 -0.386050 -0.352690 -0.356513 -0.370445 -0.696282 -0.626569 0.193179 0.189342 0.188368 0.189961 0.188306 0.189307 0.218649 0.179673 0.188194 0.187203 0.194548 0.194950 0.207300 0.175264 0.209841 0.209486 0.214852 0.248856 0.187353 0.220072 0.224712
chargesum: 0.00000
title: Mulliken charges with hydrogens summed into heavy atoms:
elementType: N C C C C C C C C C
charge: -0.044387 0.006332 0.008372 0.006135 0.012272 0.022707 0.032985 0.012119 -0.062103 0.005569
polarizability: 1.39537530e+02 5.80704305e-01 9.35313971e+01 -8.67913502e-02 7.12082537e-01 8.76610246e+01
1716.lowfreq: -6.8530 -0.0007 -0.0004 0.0005 8.9548 31.0928 42.1800 49.1874 60.2192
frequency: 31.3591 49.1632 60.1369 75.3986 105.0111 119.7408 129.4551 146.8688 150.7065 218.2142 225.7285 228.2057 244.8182 345.8696 399.3760 455.1763 497.9997 660.0299 722.8751 730.0127 752.6127 797.4349 863.3857 886.7736 938.5363 950.7408 988.2754 1009.5217 1023.4513 1037.4725 1065.0760 1079.6593 1080.4034 1088.4102 1111.2985 1132.1371 1162.5553 1182.0855 1197.6035 1221.9271 1232.2103 1261.7653 1265.1324 1278.0233 1284.0525 1293.3416 1296.8075 1303.2823 1335.0384 1353.0722 1355.1061 1371.6001 1387.4509 1434.8467 1447.3812 1462.4167 1463.1169 1465.0237 1466.7709 1470.5167 1475.9332 1477.1961 1483.8361 1488.7203 1490.5595 1498.9036 2833.5524 2863.5669 2950.4008 2951.4787 2952.7460 2956.2459 2963.0923 2968.9550 2971.4825 2984.4850 2989.2558 2992.1416 3004.2607 3009.2299 3020.0693 3034.5954 3045.4184 3068.0090 3070.4275 3071.6384 3442.5359
redmass: 3.2653 3.4831 1.5758 2.8207 1.5949 2.4812 3.1420 1.8038 2.1122 4.3335 1.1291 1.9564 1.4670 2.8162 3.5174 2.8694 2.9732 1.3134 1.0616 1.0804 1.1109 1.1640 1.2063 1.9074 1.2675 1.9785 4.5971 1.1340 3.4587 2.5662 2.6871 2.1499 2.1089 1.3647 1.7640 2.2885 3.3983 1.9033 1.5456 1.3788 1.4203 1.2637 1.3170 1.0644 1.0908 1.1232 1.1050 1.3195 1.4088 1.5822 1.6647 1.5023 1.2172 1.1512 1.2027 1.0710 1.0726 1.0707 1.0676 1.0754 1.0430 1.0747 1.0824 1.0786 1.0781 1.0739 1.0713 1.0571 1.0590 1.0587 1.0619 1.0615 1.0604 1.0587 1.0367 1.0963 1.0837 1.0979 1.1010 1.0741 1.1029 1.1034 1.1029 1.1007 1.0993 1.0994 1.0744
irintensity: 0.2646 0.0949 1.3323 0.6770 0.6575 1.3828 0.1494 0.1198 0.6797 0.0689 0.0070 1.4789 2.3136 4.0658 0.9845 6.5590 0.8772 119.8909 14.8608 0.5215 5.0231 0.2083 0.7415 4.1919 0.9985 6.1017 0.1502 1.2726 0.6966 0.0577 1.3095 1.9482 0.6134 20.9219 12.4877 4.0680 30.7631 0.3945 1.2084 3.7462 4.1119 0.4220 1.9496 0.4177 0.8815 0.0554 0.2920 0.0646 0.0763 1.6342 0.0417 7.9206 11.3746 1.6493 19.8387 0.5155 0.1139 8.3803 1.1528 0.9440 12.4942 3.9567 1.1617 22.0573 16.1272 7.3407 93.4300 178.0905 0.3114 1.1465 3.8226 0.7407 50.3281 162.3780 35.2522 0.2515 48.4874 2.4179 0.5693 52.2240 0.7010 17.5903 190.7183 100.8967 56.0036 41.6693 1.8478
temp: 298.150 k
press: 1.00000 atm
elementType: 7 6 6 6 6 6 6 6 6 6 1 1 1 1 1 1 1 1 1 1 1 1 1 1 1 1 1 1 1 1 1
symmnumber: 1
zpe: 750364.8 jmol-1
zpe.correction: 0.285799 hartree
zpe.thermalcorrener: 0.299855 hartree
zpe.thermalcorrenthalpy: 0.300799 hartree
zpe.thermalcorrgfe: 0.243835 hartree
zpe.sumelectzpe: -409.426795 hartree
zpe.sumelectthermal: -409.412739 hartree
zpe.sumelectthermalent: -409.411795 hartree
zpe.sumelectthermalfe: -409.468759 hartree
dipole: -0.0076 0.3968 -1.0020
dipole: 1.0778
quadrupole: -66.2302 -66.9166 -65.7106
quadrupole: 1.2332 -4.5615 2.2367
quadrupole: 0.0556 -0.6308 0.5752 1.2332 -4.5615 2.2367
hfenergy: -409.7125943 hartree
pointgroup: C01 [X(C9H21N1)]
dipole: -0.0060447 -0.1755673 0.3859251 debye
polarizability: 139.5260016|-0.8910369|93.4555132|0.3200828|0.9960836|87.7484372 unknown
InChI: InChI=1S/C9H21N/c1-3-4-5-6-7-8-9-10-2/h10H,3-9H2,1-2H3
charge 0 multiplicity 1
31 atoms
N  4.436767 0.478682 0.026662
C  -0.631156 0.394127 0.011469
C  0.671087 -0.437918 0.018191
C  -1.911146 -0.471858 0.006462
C  1.94678 0.433303 0.017461
C  -3.213349 0.360365 0.00055
C  -4.494298 -0.505236 -0.003392
C  3.24547 -0.395839 0.022173
C  -5.789511 0.335414 -0.010173
C  5.725659 -0.236176 0.011114
H  -0.635378 1.059866 -0.876748
H  -0.644072 1.061368 0.898883
H  0.675381 -1.10275 0.907462
H  0.682055 -1.105554 -0.868756
H  -1.906534 -1.138347 0.894567
H  -1.898755 -1.138578 -0.881318
H  1.956095 1.095333 -0.870117
H  1.933609 1.098748 0.907835
H  -3.219976 1.025977 -0.888096
H  -3.226768 1.028103 0.887608
H  -4.487084 -1.169585 0.884959
H  -4.479678 -1.172294 -0.889588
H  3.285972 -1.021011 -0.893037
H  3.226681 -1.106718 0.890293
H  -5.833739 0.986411 -0.903846
H  -5.84203 0.98828 0.8817
H  -6.690587 -0.305351 -0.013703
H  4.387669 1.16986 0.787505
H  5.863385 -0.962732 0.850984
H  6.556879 0.490611 0.045872
H  5.820273 -0.8042 -0.933475
