program: Gaussian 09
title: 000075530
version: EM64L-G09RevD.01
frameworkgroup: C1[X(C12H13N)]
method: RPBEPBE
basis: SDD
operation: Freq
keyword: #pfreq=noraman
keyword: PBEPBE/SDD
title: #p freq=noraman PBEPBE/SDD
converged: NO YES NO NO
title: Mulliken charges:
elementType: N C C C C C C C C C C C C H H H H H H H H H H H H H
charge: -0.428213 0.424745 0.387532 0.487386 -0.653489 -0.432624 -0.394484 -0.315224 -0.428790 -0.416345 -0.243369 -0.258318 -0.726599 0.221095 0.229842 0.238545 0.296537 0.213816 0.213944 0.230900 0.234787 0.221227 0.223009 0.222713 0.222046 0.229330
chargesum: 0.00000
title: Mulliken charges with hydrogens summed into heavy atoms:
elementType: N C C C C C C C C C C C C
charge: -0.131675 0.424745 0.387532 0.487386 -0.432394 -0.202782 -0.155938 0.112536 -0.197890 -0.181558 -0.022142 -0.035309 -0.052510
polarizability: 2.41802826e+02 6.26804917e+00 1.35941681e+02 -9.01397234e-02 2.04697024e-02 6.38553342e+01
1716.lowfreq: 0.0001 0.0003 0.0006 3.7660 7.1526 21.2726 49.6604 85.2204 120.9903
frequency: 49.6588 85.1163 120.9890 132.7539 185.2027 255.1657 290.7898 296.1019 302.7793 341.9293 404.5649 421.0866 469.6648 513.4144 538.8125 559.7443 620.5322 652.3781 743.0278 752.3401 757.5628 775.4514 808.6029 825.3554 845.2621 866.0556 889.1179 927.0402 945.9036 960.5834 965.5958 981.7896 1021.1298 1067.2546 1122.0504 1147.5122 1157.5404 1167.3131 1173.9704 1212.0206 1244.4029 1267.0092 1276.1123 1316.2830 1343.6825 1362.7740 1395.1437 1403.3305 1418.5963 1440.1684 1463.7340 1476.5819 1482.1908 1498.8275 1508.0124 1527.6932 1577.9358 1613.2114 1646.9164 2932.4532 2968.2350 2983.4700 3076.6924 3093.6512 3104.1650 3112.5519 3117.3704 3120.1733 3136.4828 3156.9992 3158.1634 3567.8939
redmass: 3.7431 1.7905 3.5369 4.1531 3.4851 1.1706 3.2333 3.8117 4.0476 1.2062 3.1818 3.5922 2.4129 6.6834 3.3946 5.6924 6.4264 2.5502 4.6632 1.3539 5.0398 2.2138 1.2982 1.1578 1.5519 3.3146 1.9018 3.3922 1.3481 2.3683 1.4062 1.3351 2.2471 2.6162 1.7762 1.4818 1.5485 1.2324 1.3284 1.6903 1.6789 1.1110 1.6926 1.6462 2.6044 1.5142 1.2426 1.9922 5.5444 3.8570 2.0665 1.0404 1.1007 2.2028 1.1739 3.0143 6.3167 5.6761 6.6890 1.0575 1.1043 1.0362 1.1007 1.0987 1.0907 1.0853 1.0888 1.0879 1.0946 1.0983 1.0964 1.0769
irintensity: 0.9917 6.4651 0.1392 0.0316 0.1017 2.4222 1.1731 0.0415 2.5912 93.6424 1.4619 1.3524 25.5469 0.1998 0.8651 2.2413 5.5048 0.0494 7.8740 40.3263 0.1111 0.2115 42.4033 0.1777 71.8724 0.3807 14.3981 0.7834 1.9797 1.1414 6.3318 0.0322 8.6892 0.6809 2.4588 1.7938 6.4606 8.0712 31.2733 26.7062 17.3612 0.1898 4.8596 48.2181 101.4246 2.6369 29.7233 27.9851 3.8212 29.5825 2.7601 13.1019 52.5555 174.9334 5.2268 34.3594 6.5289 66.8369 284.0254 82.0729 42.0443 34.3932 45.4480 34.6467 22.3609 9.0195 1.4451 9.3286 41.4024 58.8732 6.1674 37.6873
temp: 298.150 k
press: 1.00000 atm
elementType: 7 6 6 6 6 6 6 6 6 6 6 6 6 1 1 1 1 1 1 1 1 1 1 1 1 1
symmnumber: 1
zpe: 569087.9 jmol-1
zpe.correction: 0.216754 hartree
zpe.thermalcorrener: 0.228213 hartree
zpe.thermalcorrenthalpy: 0.229157 hartree
zpe.thermalcorrgfe: 0.179312 hartree
zpe.sumelectzpe: -518.912502 hartree
zpe.sumelectthermal: -518.901043 hartree
zpe.sumelectthermalent: -518.900099 hartree
zpe.sumelectthermalfe: -518.949944 hartree
dipole: 3.1374 -0.3711 -0.0092
dipole: 3.1593
quadrupole: -62.4999 -67.9858 -84.1410
quadrupole: -1.5301 -0.0331 0.0264
quadrupole: 9.0423 3.5565 -12.5988 -1.5301 -0.0331 0.0264
hfenergy: -519.1292562 hartree
pointgroup: C01 [X(C12H13N1)]
dipole: -1.2330982 -0.1562858 0.0030901 debye
dipolederiv: -2.0316306 0.0004874 0.000264 -0.4902887 -0.2141474 -0.0030759 -0.0074601 -0.0032068 -0.4860013 0.6088438 0.1085711 -0.0000131 0.1456938 -0.0731093 -0.0000822 -0.0002054 0.0000661 0.0653732 -0.326587 0.0841095 0.0000241 -0.1507647 -0.218961 -0.0000256 0.0001444 -0.0003665 0.0107067 1.8902258 0.2302858 -0.0001033 0.65454 0.0337503 0.0006189 -0.0003079 0.0002855 0.1480919 -0.8278445 -0.1146108 0.0000535 0.3070608 0.0817971 0.0001849 -0.0000938 0.0002732 -0.2841433 0.3279092 -0.1503217 -0.0000618 -0.0186907 0.1695634 0.0001597 -0.000119 0.0003751 -0.1552811 -0.373542 0.0446698 -0.0002979 -0.4831517 0.0308376 0.000494 0.0007965 -0.0000002 -0.2300337 0.8000931 -0.194095 -0.0017162 -0.5942907 0.3352868 0.0018359 -0.0007307 0.0019806 0.3767064 -0.2074002 -0.0754346 -0.0000362 0.0423355 0.128141 0.0001309 0.0001552 0.0002598 -0.2007258 0.2973553 -0.0954748 -0.0001173 0.0779546 0.1284188 0.0001092 -0.0001626 0.0002857 -0.1678092 0.020133 -0.0024286 -0.0000879 -0.0782548 0.1856826 0.0001707 -0.0000842 0.0001622 -0.1606899 -0.150244 0.1398714 0.00005 0.1551515 -0.1638882 -0.0000096 0.0000823 -0.000027 -0.1992 -0.1131781 -0.02893 -0.0007479 0.0476396 0.0524482 -0.0009024 -0.0002139 -0.0013843 0.0901548 0.0289225 -0.0414828 0.0000573 -0.0841567 -0.1159884 -0.0001754 -0.0000557 -0.0001901 0.1685067 0.0625715 -0.0685409 -0.0000266 -0.0169426 -0.1127851 -0.000182 -0.0001486 -0.0001342 0.1490792 -0.0453056 0.1119195 0.0003497 0.1136947 0.0164776 -0.000235 0.0004786 -0.0001732 0.1619207 0.1248342 0.0278503 0.0002316 0.0960135 0.0796105 0.0011037 0.0033658 0.0022791 0.3045595 -0.0503973 -0.0239453 -0.0281872 0.1505372 -0.0657197 -0.1147785 0.0610388 -0.1314808 -0.0995288 -0.0462912 -0.0256316 0.0293662 0.1471816 -0.0670912 0.1144923 -0.0573312 0.1305073 -0.0957304 0.0631148 -0.0782529 -0.000009 0.0001803 -0.1202752 -0.0001315 0.0000189 -0.0001283 0.1569311 0.0665682 -0.0023866 0.0000157 -0.0851248 -0.1212214 -0.0001148 -0.0000254 -0.0001514 0.1549745 -0.0658182 0.1213828 0.0001251 0.1317641 -0.0170058 -0.0001215 0.000123 -0.0001273 0.1590151 -0.1438259 -0.0669601 0.0000508 -0.06883 0.0626521 -0.0000327 0.0000441 -0.000056 0.1678663 0.108224 0.0067889 0.0213119 -0.0723244 -0.0085321 -0.1169849 -0.0273021 -0.1243517 -0.0753351 0.1074576 0.0064878 -0.0204102 -0.0736798 -0.0116884 0.1176969 0.0274847 0.1255451 -0.0730352 -0.1241886 0.0860711 -0.0000851 0.1467521 0.0057472 -0.0001451 0.0005081 -0.0002421 0.1136279 unknown
polarizability: 241.9000762|-5.384031|135.844456|-0.0357942|0.0400901|63.8553091 unknown
InChI: InChI=1S/C12H13N/c1-2-13-12-8-7-10-5-3-4-6-11(10)9-12/h3-9,13H,2H2,1H3
charge 0 multiplicity 1
26 atoms
N  -2.711538 -0.563571 0.000679
C  1.039519 -0.630559 -0.000145
C  1.344353 0.789714 0.000366
C  -1.385735 -0.128453 0.000696
C  -0.321315 -1.056651 -0.000041
C  0.250188 1.714213 0.001218
C  -1.074104 1.281461 0.001547
C  -3.882321 0.318369 0.001346
C  2.134615 -1.562913 -0.000933
C  2.711975 1.216254 0.000224
C  3.457606 -1.116525 -0.001122
C  3.754347 0.285445 -0.000503
C  -5.179281 -0.509379 -0.008544
H  -0.538655 -2.133417 -0.000747
H  0.467983 2.789602 0.001979
H  -1.884918 2.016339 0.003028
H  -2.882145 -1.568685 0.006224
H  -3.8718 0.976682 0.897062
H  -3.864142 0.98559 -0.887322
H  1.915115 -2.637855 -0.001418
H  2.929699 2.291742 0.000702
H  4.279828 -1.841537 -0.001739
H  4.797244 0.620968 -0.000605
H  -5.235756 -1.147501 -0.909898
H  -5.242897 -1.158111 0.884828
H  -6.060062 0.155578 -0.00778
