program: Gaussian 09
title: 000075520
version: EM64L-G09RevD.01
frameworkgroup: C1[X(C5H7N3O2)]
method: RPBEPBE
basis: SDD
operation: Freq
keyword: #pfreq=noraman
keyword: PBEPBE/SDD
title: #p freq=noraman PBEPBE/SDD
converged: NO NO NO NO
title: Mulliken charges:
elementType: O O N N N C C C C C H H H H H H H
charge: -0.273465 -0.269946 -0.218327 -0.388457 -0.675326 0.474138 0.201906 -0.421479 -0.662885 0.175759 0.241547 0.236813 0.300871 0.236819 0.358804 0.336011 0.347217
chargesum: 0.00000
title: Mulliken charges with hydrogens summed into heavy atoms:
elementType: O O N N N C C C C C
charge: -0.273465 -0.269946 -0.218327 -0.029652 0.007902 0.474138 0.201906 -0.179932 0.111618 0.175759
polarizability: 1.14242926e+02 1.42628186e+00 9.24637887e+01 -4.27960266e-04 -2.10327610e-03 3.96547576e+01
1716.lowfreq: -8.6243 -0.0008 -0.0006 -0.0005 5.3604 10.2030 96.8450 165.8116 179.1024
frequency: 96.8410 165.8074 179.1015 199.3156 235.7746 339.3767 345.8200 355.2953 382.6156 450.7912 462.5013 506.9769 605.4681 616.8979 630.1694 663.8284 701.4436 747.2493 752.8849 783.5551 947.0351 960.7498 1058.9755 1125.2490 1185.9631 1197.5967 1227.7468 1271.5131 1326.6929 1369.2749 1408.5029 1474.3034 1492.6734 1501.7809 1592.4605 1635.2764 1646.5358 1674.0181 2978.0079 3063.2061 3112.4573 3200.4446 3539.0697 3575.7908 3714.3843
redmass: 3.7702 8.7640 3.7098 1.1502 2.8829 1.1877 4.6957 3.2056 6.1641 7.5597 1.1749 6.5039 4.7406 5.9921 3.4123 1.9508 2.9301 2.1231 4.6892 2.3273 2.7856 2.4587 1.3455 1.2926 6.7991 2.8494 2.2243 2.6636 3.1629 2.1285 1.3637 1.3084 2.1645 1.0443 3.4450 2.5537 2.3254 5.7741 1.0353 1.1035 1.0969 1.0932 1.0771 1.0459 1.1040
irintensity: 0.2783 1.5871 4.5516 9.2824 0.0560 90.1610 1.6041 0.8341 21.0894 16.6832 193.5818 15.0494 3.3946 1.9792 7.0309 39.4728 4.9911 31.4369 5.1872 136.9150 2.8673 13.2950 5.2264 0.1118 16.4535 44.8183 33.7310 43.2781 82.4463 44.4060 20.9405 16.0490 262.6277 19.4340 42.4465 547.8047 20.4484 934.0770 47.9689 25.7190 1.3562 1.9361 64.1073 84.3771 39.9636
temp: 298.150 k
press: 1.00000 atm
elementType: 8 8 7 7 7 6 6 6 6 6 1 1 1 1 1 1 1
symmnumber: 1
zpe: 337953.6 jmol-1
zpe.correction: 0.128720 hartree
zpe.thermalcorrener: 0.137947 hartree
zpe.thermalcorrenthalpy: 0.138891 hartree
zpe.thermalcorrgfe: 0.094889 hartree
zpe.sumelectzpe: -508.728262 hartree
zpe.sumelectthermal: -508.719035 hartree
zpe.sumelectthermalent: -508.718090 hartree
zpe.sumelectthermalfe: -508.762093 hartree
dipole: 6.2556 4.3079 -0.0005
dipole: 7.5954
quadrupole: -63.4806 -54.8270 -60.1551
quadrupole: 10.6263 -0.0009 -0.0007
quadrupole: -3.9930 4.6606 -0.6675 10.6263 -0.0009 -0.0007
hfenergy: -508.8569813 hartree
pointgroup: C01[X(C5H7N3O2)]
dipole: 2.2941538 1.9148242 -0.0002062 debye
dipolederiv: -0.7139693 0.3295724 0.0000039 0.3549331 -1.2049795 0.0000002 -0.0000699 0.0001241 -0.3917909 -1.4568693 -0.0841408 0.0000105 -0.1458656 -0.5459854 0.0000062 0.000037 0.0000001 -0.3851502 -0.8003735 -0.1266426 0.0000183 0.3436905 -1.2376493 0.0000497 -0.0000323 0.0000091 -0.1798761 -1.0849495 0.4739934 -0.000037 0.3364491 -0.7067945 -0.0000031 0.000006 -0.0000022 -0.3456616 -0.7473034 -0.5155871 -0.000069 -0.6599187 -0.9988828 0.0000072 -0.0001449 -0.0000727 -0.6933563 1.596565 0.3799627 0.0000257 0.0742995 1.3316921 -0.0000161 0.0000394 -0.0000166 0.220846 1.2506437 -0.1569023 -0.0000084 -0.2155528 1.7716866 -0.0000389 0.0000299 -0.0001159 0.2988146 -1.1138623 -0.4169317 0.0000119 -0.4058707 -0.457364 0.0000014 0.000025 0.0000159 -0.349937 0.5019755 0.0566714 -0.0000184 0.0052708 -0.0461653 0.0000213 -0.0000305 0.0000074 0.2422474 1.873414 -0.0045529 -0.0000193 0.2298249 1.2707919 -0.0000236 -0.0000397 -0.0000273 0.248654 0.0653666 0.028316 -0.0000044 0.0179698 -0.0418628 0.0000133 0.0000031 0.000014 0.2051968 -0.0291976 -0.030261 0.0241975 -0.1025222 0.0680456 0.1040958 0.0771588 0.0799037 -0.0551525 0.1745207 -0.0067238 0.0000061 0.1379706 0.0585632 0.0000251 -0.0000001 0.0000148 0.1412083 -0.0291559 -0.0302602 -0.024168 -0.1025272 0.0680133 -0.1041344 -0.0771061 -0.0799236 -0.0550989 0.1756124 0.0320532 0.0000046 0.066791 0.1887689 0.0000062 0.0000092 0.0000102 0.3425578 0.1312196 0.0228707 0.0000154 0.0605362 0.2488092 0.0000069 0.0000141 0.0000312 0.389393 0.2063632 0.0485628 0.0000305 0.0045215 0.2333128 -0.0000171 0.000101 0.0000279 0.3671055 unknown
polarizability: 113.795074|3.4040462|92.9116403|-0.000232|-0.0021338|39.6547576 unknown
InChI: InChI=1S/C5H7N3O2/c1-8-3(6)2-4(9)7-5(8)10/h2,7H,6H2,1H3
charge 0 multiplicity 1
17 atoms
O  0.996666 -2.364577 0.000081
O  -3.039374 -0.009216 -0.000025
N  1.096261 -0.011669 -0.000086
N  -0.992815 -1.136355 -0.000035
N  1.200597 2.358675 -0.000116
C  0.415957 1.219591 -0.00012
C  0.391389 -1.254543 -0.000087
C  -0.975125 1.274177 -0.000137
C  2.569586 -0.083938 0.00002
C  -1.773383 0.073709 -0.00008
H  -1.49729 2.231588 -0.000181
H  2.993477 0.384579 -0.907395
H  2.835113 -1.152169 0.000174
H  2.993348 0.384835 0.907362
H  -1.517148 -2.015921 0.000046
H  0.744654 3.266495 -0.000122
H  2.214887 2.327337 -0.000298
