program: Gaussian 09
title: 000075527
version: EM64L-G09RevD.01
frameworkgroup: C1[X(C12H13N)]
method: RPBEPBE
basis: SDD
operation: Freq
keyword: #pfreq=noraman
keyword: PBEPBE/SDD
title: #p freq=noraman PBEPBE/SDD
converged: YES YES NO NO
title: Mulliken charges:
elementType: N C C C C C C C C C C C C H H H H H H H H H H H H H
charge: -0.160788 0.421601 0.414720 0.391484 -0.584742 -0.369002 -0.451018 -0.432341 -0.417535 -0.644783 -0.646846 -0.246677 -0.256964 0.243512 0.236676 0.229548 0.231102 0.234462 0.216021 0.232284 0.232328 0.234009 0.233291 0.215331 0.221361 0.222966
chargesum: 0.00000
title: Mulliken charges with hydrogens summed into heavy atoms:
elementType: N C C C C C C C C C C C C
charge: -0.160788 0.421601 0.414720 0.391484 -0.341230 -0.132326 -0.221470 -0.201239 -0.183073 0.035849 0.035785 -0.025316 -0.033998
polarizability: 2.35310236e+02 6.21651310e+00 1.39477666e+02 -5.58511744e-02 -5.57264324e-02 6.38885135e+01
1716.lowfreq: -3.1653 -0.0005 -0.0004 -0.0004 15.0101 17.0784 55.2512 79.2516 104.4229
frequency: 55.1149 79.2447 104.3654 167.3395 184.1695 205.1368 220.2989 318.4679 329.5301 340.9115 408.8502 473.0093 480.7190 514.7307 520.0624 540.8003 616.6867 653.5248 673.1310 752.3364 761.8631 776.0390 810.9420 840.2201 850.9531 887.8082 926.5627 946.0260 965.6728 965.9963 982.1459 1022.1425 1057.3410 1107.4012 1111.5723 1123.5033 1156.4580 1171.2095 1172.4604 1225.1633 1249.1430 1266.8494 1283.7756 1354.1928 1366.9501 1410.9388 1422.1464 1432.5331 1448.4722 1453.3507 1462.7161 1474.2694 1483.4388 1493.6853 1511.2338 1521.2488 1574.3174 1610.4270 1643.3187 2933.3937 2942.6191 2996.0125 3002.1088 3093.5720 3102.8148 3112.3360 3117.3300 3120.7739 3136.1879 3149.3820 3157.4796 3162.1205
redmass: 2.7427 2.9698 1.6492 1.9054 3.5000 1.8024 1.5729 3.4304 3.9639 3.6784 3.1753 2.3991 3.4491 5.2481 4.0231 3.3678 6.3793 2.4472 5.2260 1.3693 5.0316 2.0696 1.4343 1.5867 5.1906 1.9123 4.9851 1.3477 1.4153 2.5803 1.3380 2.2230 1.4991 1.2777 1.2768 1.6768 1.4985 1.1489 1.1936 1.8252 1.5628 3.6085 1.7027 3.1085 1.8778 3.3593 3.3192 1.3357 3.6680 1.3408 1.0406 1.0465 1.9670 1.1021 1.2074 3.0580 6.8964 5.6374 6.5971 1.0372 1.0395 1.0999 1.1021 1.0954 1.0936 1.0853 1.0890 1.0884 1.0945 1.0900 1.1000 1.0941
irintensity: 1.6880 4.3253 0.6628 0.2133 0.8080 0.9390 1.9108 2.6077 0.1231 2.0688 0.7896 22.9199 0.8840 0.0067 1.7339 0.0853 4.3399 0.2333 0.1037 40.5149 0.2658 0.4179 37.3542 79.1406 2.6573 8.9290 0.4136 1.7206 6.3467 22.3935 0.0199 6.1927 25.5251 0.5886 0.5384 7.1276 4.6284 8.0658 17.8190 10.3356 10.8066 30.6640 4.5262 115.8536 14.3918 15.4435 6.4223 3.1946 19.1698 24.5086 0.2595 20.7049 4.6875 1.1089 71.3833 163.6408 16.5021 64.1145 231.4026 106.3364 109.3190 28.6134 69.2222 3.9141 51.4168 7.3241 0.2983 11.9342 37.4470 21.3505 45.2495 15.5483
temp: 298.150 k
press: 1.00000 atm
elementType: 7 6 6 6 6 6 6 6 6 6 6 6 6 1 1 1 1 1 1 1 1 1 1 1 1 1
symmnumber: 1
zpe: 568160.7 jmol-1
zpe.correction: 0.216401 hartree
zpe.thermalcorrener: 0.227892 hartree
zpe.thermalcorrenthalpy: 0.228836 hartree
zpe.thermalcorrgfe: 0.178937 hartree
zpe.sumelectzpe: -518.899387 hartree
zpe.sumelectthermal: -518.887896 hartree
zpe.sumelectthermalent: -518.886952 hartree
zpe.sumelectthermalfe: -518.936851 hartree
dipole: 3.1567 -0.2046 0.0198
dipole: 3.1634
quadrupole: -61.6995 -68.1008 -84.0349
quadrupole: -1.1116 0.0553 0.0011
quadrupole: 9.5789 3.1776 -12.7565 -1.1116 0.0553 0.0011
hfenergy: -519.1157884 hartree
pointgroup: C01 [X(C12H13N1)]
dipole: -1.2412718 -0.0894778 -0.0139673 debye
dipolederiv: -1.8651629 -0.0369073 -0.0124214 -0.3462935 -0.5392829 0.0109813 0.0285735 0.0176366 -0.2922663 1.8208938 0.2560943 -0.0024661 0.3591537 -0.0628229 0.0156369 -0.0141984 0.0142187 0.1314408 0.6053804 0.1020354 -0.0014535 0.1041237 -0.0677484 0.0078817 -0.0020474 0.0076779 0.0549618 -0.3193345 0.0587106 -0.0062239 -0.1481216 -0.222398 0.0123174 0.0059109 0.0141363 0.0174044 -0.7721855 -0.1206162 0.0023015 0.3457179 0.0449002 -0.0168037 -0.0257486 -0.0213994 -0.2931044 -0.393181 0.0278313 -0.0031836 -0.3887865 0.0362168 -0.018494 0.0213439 -0.0135338 -0.2191657 0.3008967 -0.1398765 0.0117235 -0.0458605 0.1758119 -0.0194494 0.006573 -0.0206517 -0.1631031 -0.2021606 -0.0638026 0.0034424 0.0590361 0.1298271 -0.0179613 -0.0032944 -0.0189389 -0.1949685 0.2904332 -0.0796532 0.0082839 0.0667979 0.1299828 -0.0164486 0.0000093 -0.0178282 -0.1678824 0.5070597 -0.2233957 0.0173977 -0.5144758 0.3770271 -0.0152544 0.0315458 -0.0130824 0.264316 0.1619613 0.0612278 -0.0056151 0.4247409 0.5307486 -0.0074937 -0.0302599 -0.0114686 0.2643042 0.0086856 0.0070918 0.0009126 -0.0751966 0.1773783 -0.0196607 0.0056932 -0.0189005 -0.1603935 -0.1334481 0.1188644 -0.0064056 0.1584061 -0.1691623 -0.0002647 -0.0085635 -0.0006321 -0.1979216 0.0566933 -0.0232774 0.0006225 -0.0847392 -0.0917603 0.0143081 0.0043097 0.0151793 0.1673408 -0.0254119 0.1156125 -0.008043 0.1031243 -0.0027205 0.01031 -0.0071073 0.0097866 0.158882 0.0551155 -0.0800901 0.0037149 -0.0258761 -0.110402 0.0144592 0.0004077 0.0142821 0.1489893 0.058895 -0.0891476 0.004313 -0.0115285 -0.1125428 0.0150162 -0.0000734 0.0144551 0.1539425 0.0602499 -0.014046 0.0000319 -0.0961234 -0.1165807 0.0146001 0.0046915 0.0154254 0.1540567 -0.147209 -0.05523 0.000228 -0.1660282 0.0484305 0.0026713 0.006791 0.0039481 0.1153041 0.0632074 -0.0084416 0.0422688 0.1752652 -0.0599474 0.1115483 -0.0712168 0.1308021 -0.1129114 0.0656302 -0.0096939 -0.0355789 0.1834595 -0.09242 -0.1107155 0.0489473 -0.1326473 -0.0786146 0.1045158 0.0914862 -0.0973437 -0.0871489 -0.0579241 0.0735813 0.0038752 0.1167526 -0.1051294 0.1021462 0.1018164 0.0893036 -0.0917991 -0.0822676 -0.0779452 0.0058252 -0.1213534 -0.0854751 -0.2000871 -0.062188 0.0021574 0.0245335 0.097753 0.0004171 -0.0034573 -0.0004562 0.1147568 -0.0515303 0.1207191 -0.0085131 0.1336887 -0.0308075 0.0117656 -0.0092195 0.011603 0.1582655 -0.1520533 -0.0551237 0.000546 -0.0560696 0.0707112 0.0049966 0.0006893 0.0049888 0.166971 unknown
polarizability: 235.3734|-5.5013526|139.1527348|1.8232504|-4.3251334|64.1502814 unknown
InChI: InChI=1S/C12H13N/c1-13(2)12-8-7-10-5-3-4-6-11(10)9-12/h3-9H,1-2H3
charge 0 multiplicity 1
26 atoms
N  -2.924909 -0.279557 -0.007359
C  -1.564975 0.05873 -0.018206
C  0.834458 -0.574672 0.036837
C  1.224201 0.819315 -0.038926
C  -0.550149 -0.926395 0.045826
C  -1.160722 1.446773 -0.094461
C  0.184331 1.80332 -0.103386
C  1.871036 -1.569131 0.100955
C  2.613951 1.164977 -0.047332
C  -3.956047 0.761261 -0.094984
C  -3.316956 -1.690503 0.065056
C  3.219296 -1.20374 0.091083
C  3.599337 0.175344 0.016442
H  -0.807539 -1.98831 0.105583
H  -1.919538 2.232674 -0.145482
H  0.461387 2.863306 -0.161226
H  1.587127 -2.627311 0.158484
H  2.895669 2.223881 -0.105283
H  -4.951061 0.288727 -0.077905
H  -3.877494 1.348395 -1.033108
H  -3.906151 1.470063 0.756892
H  -2.939854 -2.173609 0.990249
H  -2.931393 -2.270386 -0.799446
H  -4.415649 -1.769379 0.064248
H  3.996223 -1.97538 0.140691
H  4.660524 0.447406 0.009459
