program: Gaussian 09
title: 000075589
version: EM64L-G09RevD.01
frameworkgroup: C1[X(C20H16N2O2)]
method: RPBEPBE
basis: SDD
operation: Freq
keyword: #p
keyword: freq=noraman
keyword: PBEPBE/SDD
title: #p freq=noraman PBEPBE/SDD
converged: YES YES NO NO
title: Mulliken charges:
elementType: O O N N C C C C C C C C C C C C C C C C C C C C H H H H H H H H H H H H H H H H
charge: -0.223931 -0.219865 -0.365102 -0.674137 0.189775 0.168304 0.161433 0.322468 -0.002835 -0.005568 0.381424 0.309053 -0.385557 -0.373484 0.386222 -0.391022 -0.476398 -0.261527 -0.319871 -0.580912 0.469748 -0.422346 -0.844944 -0.815683 0.274867 0.281256 0.201841 0.224550 0.235559 0.238890 0.232785 0.229824 0.250282 0.253480 0.222662 0.321550 0.323070 0.224761 0.235765 0.223613
chargesum: 0.00000
title: Mulliken charges with hydrogens summed into heavy atoms:
elementType: O O N N C C C C C C C C C C C C C C C C C C C C
charge: -0.223931 -0.219865 -0.365102 -0.029516 0.189775 0.168304 0.161433 0.322468 -0.002835 -0.005568 0.381424 0.309053 -0.110691 -0.092228 0.386222 -0.189181 -0.251848 -0.025969 -0.080981 -0.348127 0.469748 -0.192522 -0.118520 -0.131543
polarizability: 3.82946580e+02 1.02010800e+00 2.31846950e+02 -5.13257605e+00 -1.13806118e-01 1.46614810e+02
1716.lowfreq: -18.0004 -5.3938 -0.0007 -0.0002 0.0006 1.3519 7.3480 29.6364 31.1667
frequency: -17.6021 29.6325 31.1284 46.8062 63.2512 98.9928 119.0331 133.7828 151.0725 178.4430 186.1129 193.4565 204.4898 265.8008 280.1014 305.0595 333.5812 352.5658 356.5483 363.6038 370.6883 393.4468 441.6958 452.0455 458.2343 463.6809 471.0087 479.3396 492.8971 518.4476 551.5224 553.5370 556.7658 592.5746 601.8758 646.1314 653.2516 716.9707 718.8425 722.9335 747.7228 773.8382 776.2757 785.0621 811.6894 829.7347 840.9155 847.8092 884.3828 897.9533 929.8109 936.2012 952.3690 981.5486 983.6494 986.2383 995.2902 1020.2053 1040.1596 1046.0414 1050.2797 1092.4104 1097.9367 1140.1587 1145.5722 1167.1938 1172.6519 1196.1411 1211.1900 1230.5654 1244.9433 1270.1802 1289.4301 1317.6148 1335.8114 1374.3665 1384.6081 1394.9257 1397.3463 1404.7829 1407.1214 1427.7616 1451.5211 1470.0933 1471.6340 1473.6395 1475.6008 1478.3929 1502.1453 1535.9795 1565.1928 1572.5924 1591.7842 1596.5199 1609.8552 1625.3762 1629.7628 1651.5826 2974.8497 2978.6200 3056.0830 3058.8179 3084.3665 3087.0146 3115.8442 3121.3648 3126.1110 3130.5501 3150.8446 3154.2130 3161.0452 3169.2568 3565.9915 3703.1677
redmass: 3.9368 2.4940 1.3093 4.6166 7.1321 4.3457 7.1793 1.1945 2.9396 4.3471 4.2919 5.4162 2.6068 5.8533 2.6822 4.8854 4.3283 2.9859 8.5010 4.3145 1.3279 9.7338 2.1049 3.0524 2.0681 3.7602 4.0707 4.6205 4.1453 5.9587 3.7374 5.0955 4.4896 4.0366 5.6344 4.5917 6.8412 3.8845 5.2283 3.6115 5.7651 2.1938 5.4458 4.6613 1.6915 3.4925 3.5636 1.5532 1.3034 5.3598 3.3919 1.4023 1.3965 2.3867 1.5157 1.3734 1.3781 1.4929 2.1658 1.5876 1.5906 2.7600 2.4820 2.2254 1.7141 1.9403 1.6106 1.5380 1.7165 2.3747 3.2268 2.3811 1.7738 1.9884 5.1219 6.7649 3.7354 1.2894 1.2317 4.6202 2.8717 6.7679 2.9633 1.0912 1.1163 1.0586 3.6336 1.2254 2.4216 5.5294 10.2853 5.9367 7.1961 7.0128 8.5175 6.9243 7.1473 1.2394 1.0385 1.0369 1.0951 1.0978 1.0997 1.0990 1.0912 1.0872 1.0884 1.0889 1.0910 1.0968 1.0951 1.0978 1.0457 1.1030
irintensity: 0.1104 2.0482 2.6965 2.8332 0.0583 1.2362 1.8645 1.4290 0.2509 2.0663 5.7874 4.0201 2.1971 0.7544 0.6104 6.1071 4.6815 5.5847 11.6617 3.5770 34.3064 5.0551 115.0995 4.5565 83.9625 8.4608 9.3699 32.1264 9.3998 2.9398 2.4814 5.7198 3.4058 4.2014 1.1243 1.0919 5.8249 1.3814 7.6035 2.2001 1.2287 83.3061 14.0644 30.2713 36.0405 8.8445 2.0215 38.2483 5.0568 6.1462 9.2069 0.5377 1.2414 7.6652 0.9863 0.2397 1.5014 6.1718 8.7893 3.6619 26.9399 12.1315 10.1895 102.4357 14.1693 17.3151 6.2039 4.4198 0.1349 41.5561 63.3100 23.4167 2.4390 9.9774 374.3702 5.0017 118.5373 10.6633 10.4526 0.5487 0.2016 41.7495 11.4702 22.1745 3.8471 12.6161 42.2184 24.3838 51.1718 70.0363 235.4086 91.8708 496.6810 4.3588 29.0600 17.6747 33.4828 300.9139 45.9325 21.8397 21.9011 10.3640 17.4396 29.6020 25.4827 9.0599 19.7021 22.2904 13.1011 11.8088 7.2239 16.1492 129.2261 24.2490
temp: 298.150 k
press: 1.00000 atm
elementType: 8 8 7 7 6 6 6 6 6 6 6 6 6 6 6 6 6 6 6 6 6 6 6 6 1 1 1 1 1 1 1 1 1 1 1 1 1 1 1 1
symmnumber: 1
zpe: 811720.4 jmol-1
zpe.correction: 0.309168 hartree
zpe.thermalcorrener: 0.328829 hartree
zpe.thermalcorrenthalpy: 0.329773 hartree
zpe.thermalcorrgfe: 0.260893 hartree
zpe.sumelectzpe: -1030.101493 hartree
zpe.sumelectthermal: -1030.081832 hartree
zpe.sumelectthermalent: -1030.080888 hartree
zpe.sumelectthermalfe: -1030.149768 hartree
dipole: -7.2208 -0.3583 0.3137
dipole: 7.2365
quadrupole: -81.4018 -143.1808 -136.1968
quadrupole: 2.3706 0.8884 -0.1826
quadrupole: 38.8580 -22.9210 -15.9370 2.3706 0.8884 -0.1826
hfenergy: -1030.4106608 hartree
pointgroup: C01 [X(C20H16N2O2)]
dipole: 2.8404284 0.1529204 0.1193918 debye
polarizability: 382.9563758|1.6899157|231.8245194|4.5839801|1.76763|146.6274439 unknown
InChI: InChI=1S/C20H16N2O2/c1-11-6-9-17(12(2)10-11)22-19(23)14-5-3-4-13-16(21)8-7-15(18(13)14)20(22)24/h3-10H,21H2,1-2H3
charge 0 multiplicity 1
40 atoms
O  -0.724604 2.29978 -0.002521
O  -0.866854 -2.378186 -0.070761
N  -0.783769 -0.039933 -0.085287
N  5.650827 1.068115 -0.01754
C  2.075023 -0.125606 -0.049288
C  1.39527 1.133321 -0.031601
C  1.323474 -1.345848 -0.068387
C  3.518746 -0.183598 -0.043047
C  -0.079686 1.210496 -0.037255
C  -0.168033 -1.32252 -0.074314
C  -2.244559 0.010162 -0.128945
C  4.265187 1.06477 -0.021359
C  2.150013 2.321702 -0.007398
C  1.97663 -2.587721 -0.081163
C  -2.989389 0.035984 1.07682
C  4.149928 -1.466042 -0.05731
C  3.558845 2.293292 -0.003131
C  3.395224 -2.647484 -0.07615
C  -2.883744 0.028446 -1.382323
C  -4.399915 0.082382 0.975654
C  -5.070791 0.106717 -0.273326
C  -4.290996 0.074793 -1.456128
C  -2.297238 0.011536 2.42464
C  -6.586306 0.190165 -0.339496
H  1.609104 3.273666 0.00686
H  1.364738 -3.49537 -0.095075
H  5.242956 -1.55345 -0.052421
H  4.121108 3.234173 0.013817
H  3.899788 -3.618731 -0.086748
H  -2.277157 0.002958 -2.293785
H  -4.992486 0.099871 1.899422
H  -4.785043 0.085883 -2.434717
H  -1.680714 -0.899188 2.540398
H  -1.62779 0.883665 2.543033
H  -3.031607 0.031899 3.247445
H  6.194202 0.211221 -0.034235
H  6.157118 1.949579 -0.000854
H  -7.059592 -0.33645 0.508178
H  -6.927173 1.243362 -0.303244
H  -6.974935 -0.24911 -1.274956
