program: Gaussian 09
title: 000075515
version: EM64L-G09RevD.01
frameworkgroup: C1[X(C7H14OS)]
method: RPBEPBE
basis: SDD
operation: Freq
keyword: #p
keyword: freq=noraman
keyword: PBEPBE/SDD
title: #p freq=noraman PBEPBE/SDD
converged: YES YES NO NO
title: Mulliken charges:
elementType: S O C C C C C C C H H H H H H H H H H H H H H
charge: 0.139626 -0.177897 -0.335375 -0.366343 -0.355995 -0.424465 -0.692323 -0.104929 -0.838839 0.188048 0.188743 0.207597 0.228014 0.199096 0.197068 0.238223 0.237764 0.210393 0.209936 0.218058 0.304408 0.264644 0.264548
chargesum: 0.00000
title: Mulliken charges with hydrogens summed into heavy atoms:
elementType: S O C C C C C C C
charge: 0.139626 -0.177897 0.041416 0.069268 0.040168 0.051522 -0.053936 -0.104929 -0.005238
polarizability: 1.36807001e+02 -4.02402683e+00 8.80507908e+01 -8.06112644e+00 7.64460557e-01 7.11723037e+01
1716.lowfreq: -19.8025 -8.2948 0.0009 0.0030 0.0041 2.1495 13.9360 42.1356 67.5332
frequency: 11.6677 41.6957 67.4474 93.7323 110.8494 122.8467 134.6907 198.1842 224.2358 229.6426 276.2499 381.6852 413.5244 471.0454 539.1161 662.0396 706.3237 726.8382 756.2648 839.4833 892.4490 953.2400 972.8864 984.5608 1000.9416 1019.9013 1052.7700 1076.1668 1107.4438 1121.3841 1197.8506 1237.5048 1257.1279 1284.1026 1287.9964 1306.4660 1335.8270 1339.2977 1352.3591 1388.6418 1444.8851 1454.0931 1464.4479 1465.1360 1469.9531 1476.4413 1479.8788 1488.1430 1635.4886 2955.2785 2969.5698 2973.1713 2978.9281 2989.4669 2997.1837 3003.0705 3024.0962 3041.2673 3064.7558 3070.8816 3072.9143 3123.5263 3149.5451
redmass: 3.3389 2.1793 3.0861 2.4847 1.1803 1.8494 2.7182 3.5225 1.1588 3.8475 3.7338 3.4580 3.2290 8.3787 3.8019 7.6222 5.3388 1.0774 1.1778 1.2714 1.9048 1.3053 1.4622 1.9089 1.3528 3.3689 2.8626 2.3516 1.9934 1.7473 1.5357 1.3037 1.2520 1.0871 1.1294 1.3108 1.1423 1.4290 1.6226 1.2147 1.0945 1.0501 1.0566 1.0659 1.0719 1.0429 1.0714 1.0884 9.2491 1.0588 1.0589 1.0365 1.0614 1.0624 1.0958 1.0305 1.1019 1.1005 1.1030 1.1012 1.0993 1.1005 1.1061
irintensity: 0.6294 0.1034 0.4193 0.4220 0.3689 0.4559 3.3066 1.9622 0.4736 11.0300 2.5349 1.5914 4.5895 4.9046 27.2341 1.1070 43.6916 14.8535 4.8036 4.5877 3.5972 5.3968 16.6893 26.7854 25.0294 85.4828 19.1376 0.2248 6.0355 51.4108 0.4939 17.3491 4.2670 0.9390 1.7915 13.8859 14.3196 8.6809 1.5245 10.6916 12.9683 16.1980 12.3037 1.5811 0.9558 12.6885 5.4634 22.2340 167.6080 10.9715 48.4859 36.4320 0.3891 47.9331 5.4892 33.8583 18.3383 4.7241 10.4792 122.1352 51.4780 0.6394 12.4363
temp: 298.150 k
press: 1.00000 atm
elementType: 16 8 6 6 6 6 6 6 6 1 1 1 1 1 1 1 1 1 1 1 1 1 1
symmnumber: 1
zpe: 514206.4 jmol-1
zpe.correction: 0.195851 hartree
zpe.thermalcorrener: 0.208216 hartree
zpe.thermalcorrenthalpy: 0.209160 hartree
zpe.thermalcorrgfe: 0.154667 hartree
zpe.sumelectzpe: -747.691402 hartree
zpe.sumelectthermal: -747.679037 hartree
zpe.sumelectthermalent: -747.678093 hartree
zpe.sumelectthermalfe: -747.732585 hartree
dipole: -0.5630 -0.9718 -0.0932
dipole: 1.1270
quadrupole: -56.8112 -69.7932 -63.2535
quadrupole: -0.3031 -1.8186 -0.6167
quadrupole: 6.4747 -6.5072 0.0325 -0.3031 -1.8186 -0.6167
hfenergy: -747.8872528 hartree
pointgroup: C01 [X(C7H14O1S1)]
dipole: -0.2364391 -0.3231054 -0.1905361 debye
dipolederiv: -0.6123078 0.2064945 0.2394783 0.3114013 -0.2311302 -0.1514726 0.3487435 -0.1274807 -0.290308 -0.5920202 -0.0934688 0.0167089 0.2637193 -0.8997152 -0.4550201 0.243352 -0.3185365 -0.5120458 -0.0501312 0.0109225 -0.0175332 0.1226054 0.090864 0.0311892 -0.0529404 0.0444827 0.1774566 0.0872243 -0.019562 0.0072455 -0.1798958 0.0645266 0.0383634 0.0557944 0.0095842 0.1497408 0.0087068 -0.0079933 -0.0022285 -0.0895461 0.1124573 0.0270219 0.0293273 0.0218204 0.1604901 -0.5041876 -0.0867307 0.0421572 0.0300932 0.0272458 -0.0007335 0.1246495 0.0345064 0.1092091 -0.0852302 -0.0309213 0.0047877 0.0217274 0.0608996 0.0116345 -0.0200903 0.0127253 0.0922851 1.2751056 -0.1013449 -0.3874589 -0.5021863 0.8925232 0.6364516 -0.7643316 0.4830325 0.5488927 0.1367708 0.0514615 0.0067677 0.1279808 -0.0494243 -0.1047424 0.0628934 -0.0871282 0.0181535 0.0322942 -0.0044573 0.01569 -0.007594 0.0379011 0.0642366 0.0228123 0.0898623 -0.1721748 0.039328 0.0081083 -0.0006655 -0.0106801 -0.1373215 -0.0925939 -0.0066506 -0.11894 0.0059181 0.0386221 0.0024634 0.0130732 0.0074528 0.0451064 0.0559068 0.0113213 0.0803773 -0.1409644 0.0610158 -0.0037814 -0.0115228 0.0093065 -0.0760902 -0.07622 -0.0013831 -0.0942633 0.0235093 0.0301558 -0.0327554 -0.0222726 -0.001886 -0.1377421 -0.0965685 -0.011055 -0.1279339 0.0107633 0.0246818 -0.019214 0.0555836 -0.0008075 0.0448523 0.0638519 0.0266512 0.0945384 -0.1698513 0.0489924 -0.0168049 0.0378541 -0.0235389 0.0738682 0.0325616 -0.001042 0.0617173 -0.084 0.0602445 0.0361758 0.01107 0.0346256 -0.0480241 -0.0707842 -0.0020799 -0.1036416 0.0324103 0.0722779 -0.0165745 0.0062399 -0.0432374 0.0673571 0.0584298 0.072465 0.071668 -0.1650744 0.0752018 0.0047537 0.0172452 -0.0620741 -0.1124348 -0.1165538 -0.0100752 -0.1259031 0.0123983 -0.1555109 0.1001277 -0.052191 0.1322437 -0.0002748 0.0486011 -0.0695463 0.0470161 0.0776166 0.1154691 0.028459 0.0225371 -0.0705013 0.0160318 -0.0348198 -0.0360705 -0.0663745 0.0963587 -0.0052803 -0.0487599 0.0566115 -0.0866262 0.0991781 0.0602227 0.0554645 0.065231 -0.0587335 -0.1014228 0.0334021 -0.0591775 0.0174178 0.0593456 0.0710376 -0.0782097 0.0536397 0.0779497 unknown
polarizability: 135.96111|-0.9376491|84.2603973|-11.3229034|7.3402064|75.8085878 unknown
InChI: InChI=1S/C7H14OS/c1-3-4-5-6-7(8)9-2/h3-6H2,1-2H3
charge 0 multiplicity 1
23 atoms
S  2.917792 -0.96081 -0.749382
O  1.931377 1.135973 0.735435
C  -2.222394 -0.432711 0.092867
C  -0.849932 0.248619 -0.101189
C  -3.404528 0.464051 -0.341534
C  0.322318 -0.675241 0.321563
C  -4.776128 -0.218217 -0.148274
C  1.6694 0.024104 0.226139
C  4.402811 0.184931 -0.618611
H  -2.34871 -0.711738 1.160005
H  -2.252777 -1.380749 -0.483822
H  -0.724431 0.536977 -1.163725
H  -0.801853 1.181661 0.491179
H  -3.375226 1.410367 0.235709
H  -3.276465 0.745111 -1.406678
H  0.181237 -0.971435 1.381329
H  0.328056 -1.602146 -0.280738
H  -4.942716 -0.481117 0.913452
H  -4.841496 -1.151368 -0.739054
H  -5.603915 0.441715 -0.466341
H  4.080231 1.06563 -0.036792
H  4.710511 0.481678 -1.631343
H  5.215137 -0.344486 -0.100793
