program: Gaussian 09
title: 000075494
version: EM64L-G09RevD.01
frameworkgroup: C1[X(C16H6O6)]
method: RPBEPBE
basis: SDD
operation: Freq
keyword: #pfreq=noraman
keyword: PBEPBE/SDD
title: #p freq=noraman PBEPBE/SDD
converged: NO YES NO NO
title: Mulliken charges:
elementType: O O O O O O C C C C C C C C C C C C C C C C H H H H H H
charge: -0.225216 -0.225214 -0.149582 -0.149577 -0.148299 -0.148305 0.380002 0.380014 0.147436 0.147444 -0.494006 -0.494011 0.148343 0.148338 -0.381101 -0.381102 -0.360424 -0.360430 0.124350 0.124344 0.135854 0.135857 0.286741 0.286738 0.257323 0.257325 0.278579 0.278580
chargesum: 0.00000
title: Mulliken charges with hydrogens summed into heavy atoms:
elementType: O O O O O O C C C C C C C C C C C C C C C C
charge: -0.225216 -0.225214 -0.149582 -0.149577 -0.148299 -0.148305 0.380002 0.380014 0.147436 0.147444 -0.207265 -0.207273 0.148343 0.148338 -0.123777 -0.123778 -0.081846 -0.081850 0.124350 0.124344 0.135854 0.135857
polarizability: 3.40212306e+02 -1.57368933e-03 2.02444340e+02 -1.11246617e+01 -1.67968835e-03 8.43985510e+01
1716.lowfreq: -4.4445 -2.3254 -0.0009 -0.0007 -0.0005 0.6619 32.4276 37.7705 55.1662
frequency: 32.4270 37.7633 55.1662 107.5759 132.6791 156.7465 159.7679 172.9716 173.9537 194.4069 220.1624 253.9185 318.6958 324.0915 364.5265 390.3235 416.8382 420.0787 480.7219 513.1863 528.1902 546.7115 547.3267 584.1776 595.1819 611.3464 643.8573 662.4125 671.8767 674.8999 693.7476 718.0532 724.3715 733.5575 760.6577 761.0039 775.1756 775.5539 822.8625 855.2981 872.1159 899.6400 926.8131 940.9729 987.3203 990.4343 1004.0671 1035.9952 1040.0279 1080.1262 1097.7728 1161.5783 1177.7491 1220.7161 1224.3105 1271.7574 1273.3330 1303.1099 1348.6771 1396.9775 1435.9698 1444.6208 1463.6223 1500.5236 1597.1686 1606.9831 1618.9987 1625.3634 1697.6093 1698.7228 1749.5406 1754.2934 3147.9439 3151.8348 3158.2862 3162.4954 3173.2234 3174.2554
redmass: 9.6001 10.4468 10.3111 8.0542 5.4598 9.2315 14.4156 7.9004 10.9266 11.3924 8.1463 6.9296 6.2603 11.6971 10.6303 5.1852 3.4357 3.2198 7.4763 9.7319 8.4390 6.6555 6.6423 11.0501 14.0005 8.9753 8.5047 4.2364 3.9504 9.6641 8.8206 6.3325 7.1443 6.6972 5.7350 6.1328 12.7190 13.3138 8.0131 1.4415 1.5777 4.4080 1.4015 1.5666 1.3755 1.3850 5.6005 5.0241 2.5075 4.0590 3.1514 1.5959 1.5989 3.6072 2.1459 1.3959 1.8520 2.3610 4.9228 9.3645 4.0480 5.0394 2.6044 3.4229 7.9206 8.5344 7.2469 7.6776 13.1021 13.0905 12.9899 12.9836 1.0894 1.0887 1.0932 1.0927 1.0970 1.0972
irintensity: 0.3072 4.3156 3.6336 0.0971 0.2038 0.1391 4.0063 0.3101 1.2849 0.9153 3.0042 1.7848 0.0242 13.8398 6.3587 1.0512 1.8934 0.0485 9.3838 1.6510 16.5397 15.3763 0.1075 2.0005 4.6588 5.1946 3.4392 28.0556 10.0742 19.2117 49.2329 0.9308 2.2493 0.6215 0.0126 0.5546 90.3679 267.1949 12.1373 50.2930 12.4041 27.9157 14.2790 0.0325 2.4929 0.3591 112.7233 32.7818 109.2931 2.6405 3.1489 11.5125 14.6563 377.2716 42.1440 7.5465 5.6949 21.2815 2.1836 3.8118 24.5484 4.8637 9.6180 2.3271 1.0072 5.7177 8.7510 52.3101 330.1023 597.5052 489.4608 61.9067 4.9432 1.4633 4.3505 0.1082 1.4719 2.9967
temp: 298.150 k
press: 1.00000 atm
elementType: 8 8 8 8 8 8 6 6 6 6 6 6 6 6 6 6 6 6 6 6 6 6 1 1 1 1 1 1
symmnumber: 1
zpe: 472687.7 jmol-1
zpe.correction: 0.180037 hartree
zpe.thermalcorrener: 0.196457 hartree
zpe.thermalcorrenthalpy: 0.197401 hartree
zpe.thermalcorrgfe: 0.134839 hartree
zpe.sumelectzpe: -1063.204664 hartree
zpe.sumelectthermal: -1063.188244 hartree
zpe.sumelectthermalent: -1063.187300 hartree
zpe.sumelectthermalfe: -1063.249862 hartree
dipole: 0.0000 -6.1408 -0.0025
dipole: 6.1408
quadrupole: -200.2729 -128.4340 -122.5702
quadrupole: 0.0030 -3.4478 -0.0022
quadrupole: -49.8472 21.9917 27.8555 0.0030 -3.4478 -0.0022
hfenergy: -1063.384701 hartree
pointgroup: C01 [X(C16H6O6)]
dipole: 0.0000272 2.4159925 -0.0010045 debye
polarizability: 340.2750265|-0.0023606|202.4443403|10.3783173|0.0002581|84.3358307 unknown
InChI: InChI=1S/C16H6O6/c17-13-9-3-1-7(5-11(9)15(19)21-13)8-2-4-10-12(6-8)16(20)22-14(10)18/h1-6H
charge 0 multiplicity 1
28 atoms
O  -5.195844 -0.996464 0.227783
O  5.19584 -0.996578 -0.227322
O  -3.747769 -2.745501 0.85934
O  3.747795 -2.745614 -0.858971
O  -5.987448 1.110232 -0.476934
O  5.987399 1.110068 0.477572
C  -0.744294 0.61016 -0.039513
C  0.744297 0.610168 0.039392
C  -2.880252 -0.514626 0.194734
C  2.880271 -0.514568 -0.194945
C  -1.483605 -0.564366 0.285289
C  1.483621 -0.56434 -0.285445
C  -3.560916 0.656317 -0.205188
C  3.560918 0.656355 0.205062
C  -1.445652 1.786191 -0.44672
C  1.445639 1.786188 0.446658
C  -2.854985 1.825442 -0.534328
C  2.854971 1.825444 0.534297
C  -3.885021 -1.578852 0.482301
C  3.885056 -1.578736 -0.482649
C  -5.025493 0.390152 -0.196633
C  5.025497 0.390183 0.196575
H  -0.985293 -1.477406 0.626081
H  0.98532 -1.477367 -0.626287
H  -0.872753 2.675324 -0.729859
H  0.872728 2.675293 0.729856
H  -3.380572 2.729763 -0.854572
H  3.380544 2.729741 0.854628
