program: Gaussian 09
title: 000075484
version: EM64L-G09RevD.01
frameworkgroup: C1[X(C8H8O4)]
method: RPBEPBE
basis: SDD
operation: Freq
keyword: #p
keyword: freq=noraman
keyword: PBEPBE/SDD
title: #p freq=noraman PBEPBE/SDD
converged: NO YES NO NO
title: Mulliken charges:
elementType: O O O O C C C C C C C C H H H H H H H H
charge: -0.464704 -0.266614 -0.433685 -0.342756 0.159487 0.016232 -0.360126 0.190556 -0.197743 -0.324927 0.242766 -0.497415 0.265835 0.232290 0.255781 0.403573 0.389243 0.246980 0.247085 0.238141
chargesum: 0.00000
title: Mulliken charges with hydrogens summed into heavy atoms:
elementType: O O O O C C C C C C C C
charge: -0.061131 -0.266614 -0.044441 -0.342756 0.159487 0.016232 -0.094291 0.190556 0.034547 -0.069146 0.242766 0.234792
polarizability: 1.48041004e+02 1.29947689e+00 1.16521680e+02 2.67658340e-02 1.82338033e-03 4.55515875e+01
1716.lowfreq: -8.2991 -0.0012 -0.0006 -0.0006 5.8154 11.3443 71.8386 90.3840 131.5004
frequency: 71.8225 90.3600 131.4981 147.4246 160.0265 224.4230 278.9027 291.4343 321.2662 349.7811 427.1682 479.6623 481.1064 518.9106 559.8625 571.9574 614.9919 688.8058 736.0545 740.1089 795.7558 811.0127 851.2089 865.6672 903.8380 968.0826 976.5864 1055.5815 1114.5372 1127.5227 1153.2483 1170.1974 1188.3976 1226.4363 1287.8026 1301.9082 1371.0862 1415.2387 1431.2533 1452.5524 1453.2965 1462.5187 1466.8850 1563.6012 1605.7382 1638.2176 2993.7766 3010.3742 3114.8030 3150.0500 3156.4845 3171.5304 3184.4420 3500.8894
redmass: 5.0540 1.1173 4.9694 4.1001 5.5500 4.5309 5.0724 5.5083 5.6741 4.9856 10.5808 3.9838 7.2896 1.1997 3.5391 4.9860 7.7440 6.8912 2.4583 6.4395 1.8975 6.2901 1.0761 7.2193 1.3893 1.3166 6.4621 2.0118 1.2595 2.4561 1.5426 1.1922 1.4957 3.2723 2.7947 2.2092 1.7151 2.5663 1.6159 5.2162 1.0493 1.0991 2.6030 5.0138 5.1412 5.5199 1.0681 1.0295 1.1049 1.0872 1.1053 1.0928 1.0984 1.0646
irintensity: 1.1485 0.5581 1.3291 0.7309 3.4875 2.3314 23.0413 0.9483 1.2845 15.0429 3.6669 23.8275 3.6580 141.6036 6.6266 34.4210 5.8158 0.1099 51.2158 2.5913 37.3768 17.4929 146.1477 10.6234 0.2748 0.7889 67.3624 60.0400 0.0483 144.8029 124.1279 37.1252 66.4707 12.0284 445.2498 183.7308 161.1548 92.8223 25.6157 144.2658 15.3527 0.4392 63.2087 62.7443 3.9348 78.3754 343.5382 23.2688 22.6878 7.4675 13.5038 3.6400 8.0128 72.1566
temp: 298.150 k
press: 1.00000 atm
elementType: 8 8 8 8 6 6 6 6 6 6 6 6 1 1 1 1 1 1 1 1
symmnumber: 1
zpe: 387746.1 jmol-1
zpe.correction: 0.147685 hartree
zpe.thermalcorrener: 0.158607 hartree
zpe.thermalcorrenthalpy: 0.159551 hartree
zpe.thermalcorrgfe: 0.111001 hartree
zpe.sumelectzpe: -609.674690 hartree
zpe.sumelectthermal: -609.663768 hartree
zpe.sumelectthermalent: -609.662824 hartree
zpe.sumelectthermalfe: -609.711374 hartree
dipole: -2.9915 1.4004 0.0027
dipole: 3.3030
quadrupole: -61.2109 -66.1993 -71.5320
quadrupole: 0.1420 -0.0105 0.0152
quadrupole: 5.1031 0.1148 -5.2179 0.1420 -0.0105 0.0152
hfenergy: -609.8223749 hartree
pointgroup: C01 [X(C8H8O4)]
dipole: 1.1630432 0.5791465 -0.0251823 debye
dipolederiv: -0.5467467 0.2027777 0.0099277 0.0485872 -1.2232863 -0.0209242 0.0061289 -0.0255932 -0.399393 -1.607884 -0.2143441 0.0384853 -0.6516762 -0.5536001 0.0149566 0.0262011 0.0000452 -0.2865025 -0.793571 -0.6097693 -0.0021942 -0.6878838 -0.762567 0.013922 -0.0040804 0.0114527 -0.4134669 -0.8471762 0.173683 0.0205016 0.1336305 -0.981152 -0.0199009 0.019701 -0.0214517 -0.3520656 -0.9416774 0.1136721 0.0327122 0.3314267 -0.1287509 -0.01327 0.0381086 -0.006217 -0.0222657 0.1165174 -0.6663601 -0.0184352 0.1023995 0.9227231 0.0174587 0.0001996 0.0419515 0.0356733 0.1367364 0.0668411 -0.0072814 -0.3720435 -0.0608892 0.0141918 -0.0179906 0.0000423 -0.144667 0.6651965 0.955606 0.0034423 0.7174068 0.4139802 -0.0151025 -0.002316 -0.0226279 0.067167 -0.2507502 -0.1372513 -0.0005471 0.0097726 0.1014236 0.0061047 0.0029077 0.0104854 -0.1736369 0.1197393 0.0431027 -0.0075875 -0.1174299 0.0033239 0.0076111 -0.0114356 0.0027533 -0.1517245 2.2268098 -0.0478572 -0.0652521 0.2859119 1.1745152 0.0130817 -0.0562357 0.0245159 0.2647408 0.8273641 0.0326296 -0.0177573 -0.054002 0.2196605 0.0003157 -0.0198495 -0.0024156 0.2781333 0.0456793 -0.0782413 0.0019311 -0.061274 0.0465738 -0.0009447 0.0024106 -0.0004266 0.1670396 0.0689092 0.0430665 0.0040246 0.054451 -0.1008693 -0.0080422 0.0041731 -0.0074924 0.1644641 -0.0506456 0.0375914 0.0078682 0.0374942 0.1004031 -0.0028287 0.0080119 -0.0029662 0.1685314 0.5662219 0.0144208 -0.0061622 0.0082904 0.4340497 0.0008933 -0.0065413 0.000621 0.3774362 0.3276583 0.1522832 0.005707 0.1619522 0.322873 -0.0068631 0.0059143 -0.0065598 0.3925431 -0.0231387 -0.0127529 -0.0093646 0.086889 0.0585623 -0.0975663 0.0439372 -0.0753647 -0.0541181 -0.0251601 -0.0077411 0.006973 0.0959202 0.0489641 0.0969261 -0.0404641 0.0815316 -0.0418025 -0.0140821 -0.0613568 0.0030085 -0.1298228 -0.0359375 -0.000019 0.0012191 -0.0022839 0.1239138 unknown
polarizability: 147.9768817|-0.4797151|116.4363634|-3.3337497|1.7190979|45.7010267 unknown
InChI: InChI=1S/C8H8O4/c1-12-8(11)5-3-2-4-6(9)7(5)10/h2-4,9-10H,1H3
charge 0 multiplicity 1
20 atoms
O  -0.596821 -2.049857 -0.072624
O  2.628183 0.728167 -0.110774
O  -3.160735 -1.199611 0.029665
O  1.919358 -1.484508 -0.143325
C  0.267901 0.283319 -0.044426
C  -0.788426 -0.674519 -0.033955
C  -0.048226 1.673051 -0.000826
C  -2.144222 -0.245313 0.01947
C  -1.391089 2.081752 0.051433
C  -2.443252 1.126003 0.061271
C  1.64058 -0.234933 -0.102893
C  4.0247 0.227372 -0.172342
H  0.767708 2.4002 -0.00923
H  -1.637401 3.147483 0.084302
H  -3.492099 1.434748 0.101904
H  0.411231 -2.220811 -0.108917
H  -2.743126 -2.102344 -0.005133
H  4.176987 -0.357936 -1.094062
H  4.238989 -0.40771 0.702901
H  4.64316 1.135148 -0.168538
