program: Gaussian 09
title: 000075481
version: EM64L-G09RevD.01
frameworkgroup: C1[X(C9H14O4)]
method: RPBEPBE
basis: SDD
operation: Freq
keyword: #pfreq=noraman
keyword: PBEPBE/SDD
title: #p freq=noraman PBEPBE/SDD
converged: YES YES NO NO
title: Mulliken charges:
elementType: O O O O C C C C C C C C C H H H H H H H H H H H H H H
charge: -0.267400 -0.286039 -0.232838 -0.250363 -0.629714 0.426579 0.276006 -0.222879 0.151397 -0.219929 -0.672321 -0.675272 -0.659293 0.264371 0.245785 0.227838 0.227189 0.235608 0.227842 0.211708 0.230054 0.229661 0.212508 0.227664 0.230708 0.231069 0.260061
chargesum: 0.00000
title: Mulliken charges with hydrogens summed into heavy atoms:
elementType: O O O O C C C C C C C C C
charge: -0.267400 -0.286039 -0.232838 -0.250363 -0.119559 0.426579 0.276006 0.232149 0.151397 0.243521 -0.000898 -0.004393 -0.168163
polarizability: 1.23048190e+02 -1.40854202e+01 1.27763035e+02 7.52310561e+00 1.84236057e+00 8.28857133e+01
1716.lowfreq: -3.0560 -0.0003 0.0001 0.0004 5.9309 9.4878 13.9747 36.0517 48.5405
frequency: 13.6953 35.9904 48.4947 58.9173 73.2861 99.4990 117.3999 140.3586 156.8820 179.0737 251.7168 252.8750 283.0118 303.7749 342.7381 361.8341 385.7597 422.2096 483.1482 547.4933 604.9500 616.1508 733.5004 783.1854 795.9518 799.4608 800.3796 827.3324 863.1072 905.5761 938.9553 971.3369 1001.5769 1026.5606 1029.1344 1109.3893 1112.5410 1115.6111 1131.4535 1136.5164 1136.9694 1181.5332 1248.7266 1250.2832 1293.8465 1315.7392 1357.3965 1360.2222 1399.4339 1401.4643 1412.7524 1437.7085 1463.7243 1463.9717 1473.4579 1475.4379 1486.1911 1487.7026 1617.0157 1648.9599 1660.2039 2994.8035 2995.5825 3008.8342 3010.2183 3011.2638 3067.2052 3068.7993 3071.5063 3091.6318 3092.2944 3104.8236 3106.6138 3107.1143 3216.7085
redmass: 4.0830 2.9017 4.3526 2.9949 4.4887 3.2308 2.7514 2.7551 2.4827 3.8522 1.2771 1.2585 3.5111 4.1820 3.3773 3.0000 3.8174 5.3121 3.6518 3.9798 2.8891 2.6479 3.3247 2.0778 2.1750 1.1073 1.5224 3.4160 4.4174 4.4592 2.0034 1.9738 1.3956 2.4638 2.4159 3.1620 2.2999 2.5604 4.2611 1.4803 1.4923 1.2514 1.1353 1.1310 1.9585 2.0252 1.4075 1.4837 1.2737 1.2650 1.1452 1.1362 1.0405 1.0402 1.0605 1.0591 1.0677 1.0701 11.5710 9.7893 5.7696 1.0357 1.0359 1.0584 1.0584 1.0608 1.1066 1.1062 1.0987 1.0985 1.0985 1.0624 1.1027 1.1025 1.1155
irintensity: 0.0981 0.8461 0.3116 0.2643 1.4734 4.4263 2.0090 2.6434 7.1152 2.0792 1.3439 0.8668 7.1835 3.4071 5.9773 11.4464 1.1047 2.3568 3.7660 7.5899 4.6168 1.6833 18.4393 13.0870 2.8072 3.9918 3.4627 2.7284 3.3745 7.3576 16.1201 17.3577 58.0549 62.3424 64.3431 121.1388 37.3533 88.9732 492.8029 10.3493 12.1315 17.8968 0.0169 0.0055 33.2145 137.3339 2.4884 3.7415 18.0598 21.4236 25.2680 42.6168 14.5661 9.7071 5.4076 2.5892 12.0629 14.9726 160.2756 160.7343 1.9692 18.4442 23.4671 16.7258 21.2353 9.5318 8.7216 5.5144 4.1575 31.3767 30.5444 4.8283 44.9439 43.4891 4.2060
temp: 298.150 k
press: 1.00000 atm
elementType: 8 8 8 8 6 6 6 6 6 6 6 6 6 1 1 1 1 1 1 1 1 1 1 1 1 1 1
symmnumber: 1
zpe: 570504.9 jmol-1
zpe.correction: 0.217294 hartree
zpe.thermalcorrener: 0.232646 hartree
zpe.thermalcorrenthalpy: 0.233590 hartree
zpe.thermalcorrgfe: 0.172022 hartree
zpe.sumelectzpe: -651.220406 hartree
zpe.sumelectthermal: -651.205054 hartree
zpe.sumelectthermalent: -651.204110 hartree
zpe.sumelectthermalfe: -651.265678 hartree
dipole: -2.7937 1.1848 -2.0457
dipole: 3.6597
quadrupole: -76.5603 -64.3341 -82.0438
quadrupole: 1.7932 -4.1350 3.7282
quadrupole: -2.2476 9.9787 -7.7311 1.7932 -4.1350 3.7282
hfenergy: -651.4377001 hartree
pointgroup: C01 [X(C9H14O4)]
dipole: 1.1348792 0.3465707 0.8155156 debye
polarizability: 125.991088|14.3131724|124.6486699|7.678943|-2.6330701|83.0571809 unknown
InChI: InChI=1S/C9H14O4/c1-4-12-8(10)6-7(3)9(11)13-5-2/h3-6H2,1-2H3
charge 0 multiplicity 1
27 atoms
O  2.289942 -0.49024 0.42024
O  -1.215056 1.097736 0.267335
O  0.891131 -0.727548 -1.429285
O  -3.167202 0.12099 -0.552874
C  0.063524 -1.241232 0.862312
C  -1.359382 -1.285237 0.343049
C  1.07331 -0.794816 -0.194916
C  3.398167 -0.069102 -0.492773
C  -2.027978 0.001994 -0.039996
C  -1.75852 2.43768 -0.106785
C  4.613646 0.203584 0.387018
C  -0.689549 3.465003 0.250118
C  -2.073554 -2.434039 0.214825
H  0.157906 -0.554779 1.721901
H  0.370341 -2.243793 1.215074
H  3.574223 -0.879704 -1.223097
H  3.065786 0.826241 -1.048752
H  -1.992792 2.42439 -1.18637
H  -2.702019 2.594545 0.447335
H  5.465955 0.522759 -0.240249
H  4.400299 1.003136 1.116843
H  4.910891 -0.70293 0.941487
H  -1.04548 4.478879 -0.008949
H  -0.462464 3.44231 1.32981
H  0.242454 3.270982 -0.307848
H  -1.644903 -3.408815 0.471442
H  -3.101774 -2.406094 -0.161594
