program: Gaussian 09
title: 000075506
version: EM64L-G09RevD.01
frameworkgroup: C1[X(C15H14O3)]
method: RPBEPBE
basis: SDD
operation: Freq
keyword: #pfreq=noraman
keyword: PBEPBE/SDD
title: #p freq=noraman PBEPBE/SDD
converged: YES YES NO NO
title: Mulliken charges:
elementType: O O O C C C C C C C C C C C C C C C H H H H H H H H H H H H H H
charge: -0.278491 -0.286601 -0.213677 -0.434965 0.269745 0.450641 0.204812 -0.314387 -0.485869 0.429419 -0.411333 -0.443587 -0.365261 -0.220037 -0.220993 -0.235193 -0.214784 -0.524251 0.224860 0.230863 0.253852 0.294825 0.234106 0.232314 0.256026 0.230570 0.231599 0.232741 0.161691 0.215197 0.262459 0.233707
chargesum: 0.00000
title: Mulliken charges with hydrogens summed into heavy atoms:
elementType: O O O C C C C C C C C C C C C C C C
charge: -0.278491 -0.286601 -0.213677 0.020759 0.269745 0.450641 0.204812 -0.060535 -0.191043 0.429419 -0.177227 -0.211273 -0.109234 0.010533 0.010606 -0.002453 -0.053093 0.187112
polarizability: 2.83579085e+02 -1.17995133e+01 1.62096318e+02 -1.26840686e+01 -1.58742297e+01 9.66319340e+01
1716.lowfreq: -4.9993 -0.0010 -0.0007 -0.0003 1.6529 6.7633 18.3031 23.7470 50.1009
frequency: 18.1392 23.7413 50.0875 67.6638 78.7239 112.5859 133.2048 146.9796 164.2951 187.8573 200.6653 214.9919 269.1824 295.4293 371.8695 385.6507 401.1132 416.0191 455.3968 470.0081 493.3776 552.6859 575.7993 609.7399 616.0195 642.5312 701.7789 712.5425 743.2240 744.9975 775.0156 805.1510 831.8687 855.6216 894.8938 915.1321 918.9541 938.0530 948.5820 979.1327 990.1958 992.8168 996.6360 997.4231 1005.5198 1027.3607 1088.5149 1109.1570 1111.1369 1154.8645 1163.9498 1174.1180 1188.7776 1198.0035 1203.3621 1226.3949 1254.0386 1264.0373 1320.6759 1354.6584 1369.7508 1388.1888 1402.1453 1412.1504 1440.6532 1442.2471 1457.2514 1471.0453 1481.2944 1485.8926 1492.5070 1565.8977 1596.5826 1600.2929 1617.8991 1620.4088 2860.1863 2956.1344 2979.7145 3020.0367 3088.3282 3119.1613 3127.9013 3130.3773 3130.6616 3142.3743 3153.8747 3164.4775 3166.9696 3167.5746
redmass: 3.8160 6.0349 5.4744 2.1644 3.9322 3.5546 1.7668 6.1567 4.1107 4.0097 4.9125 3.2168 3.3666 3.3141 4.3212 3.6453 2.8224 8.4102 4.5431 3.2289 3.6371 5.8248 5.5446 4.2011 6.4218 6.3799 2.1055 5.4687 2.3462 2.2513 4.4706 1.4300 3.8227 1.2500 6.2434 1.3909 1.4090 1.3791 7.1117 1.3922 5.8666 1.8518 3.0693 1.4378 1.6174 2.1664 1.5522 2.3302 1.2884 1.3679 1.8152 1.0556 1.1183 1.2020 1.8316 2.0630 4.6863 1.5198 1.3261 1.6558 2.0775 4.8175 2.5340 1.9792 1.8750 1.7501 1.0723 1.2588 1.0567 2.4351 2.1816 7.9388 6.1470 6.3044 6.0973 6.8340 1.0844 1.0568 1.0340 1.1052 1.0984 1.0876 1.0891 1.0869 1.1042 1.0917 1.0961 1.0921 1.0937 1.1015
irintensity: 1.2319 0.6963 0.3128 5.4901 0.9705 12.5714 0.9147 2.2708 4.9874 2.6801 1.0862 2.1091 4.3189 10.3988 2.1783 3.5773 1.1101 0.4972 13.1401 3.8240 13.6284 3.5084 0.8477 7.3743 0.6239 28.0281 36.6684 31.5081 37.4531 27.9410 6.4585 55.4689 7.6995 0.2886 41.4589 16.4469 9.7253 6.1541 127.2256 0.6391 0.3520 9.0493 25.7142 0.7852 0.3886 6.7923 7.3745 141.7659 13.4812 19.6950 3.0378 0.2535 4.7447 5.6514 28.5960 11.0673 581.9782 7.2152 8.1609 35.0433 12.0022 3.8533 1.6369 38.4064 20.3120 51.1921 10.8368 82.8242 16.1961 2.0572 102.4803 83.4755 6.0908 321.5875 1.1106 48.0622 143.4032 28.6269 70.9981 23.7755 29.6452 7.8112 9.5763 0.7261 14.6830 18.1223 31.1627 3.0727 17.5641 16.8351
temp: 298.150 k
press: 1.00000 atm
elementType: 8 8 8 6 6 6 6 6 6 6 6 6 6 6 6 6 6 6 1 1 1 1 1 1 1 1 1 1 1 1 1 1
symmnumber: 1
zpe: 655507.7 jmol-1
zpe.correction: 0.249670 hartree
zpe.thermalcorrener: 0.266272 hartree
zpe.thermalcorrenthalpy: 0.267216 hartree
zpe.thermalcorrgfe: 0.202960 hartree
zpe.sumelectzpe: -804.340620 hartree
zpe.sumelectthermal: -804.324018 hartree
zpe.sumelectthermalent: -804.323073 hartree
zpe.sumelectthermalfe: -804.387329 hartree
dipole: -6.2692 -3.0098 1.4861
dipole: 7.1113
quadrupole: -126.4019 -94.4016 -104.6511
quadrupole: -10.2369 1.7635 -0.2636
quadrupole: -17.9170 14.0832 3.8338 -10.2369 1.7635 -0.2636
hfenergy: -804.5902895 hartree
pointgroup: C01 [X(C15H14O3)]
dipole: -2.3988536 -0.7100348 1.2525928 debye
polarizability: 280.3877136|-23.5080114|136.6324922|-19.2890088|-33.9285796|125.2871316 unknown
InChI: InChI=1S/C15H14O3/c1-17-15-9-13(10-16)7-8-14(15)18-11-12-5-3-2-4-6-12/h2-10H,11H2,1H3
charge 0 multiplicity 1
32 atoms
O  -0.417914 0.079374 0.173127
O  1.268983 1.917096 -1.135577
O  6.018736 -0.140183 -0.778931
C  -1.335108 -0.959842 0.701661
C  0.948549 -0.206523 0.1386
C  -2.755232 -0.484442 0.484279
C  1.780384 0.769598 -0.511788
C  1.529899 -1.380092 0.681988
C  3.15729 0.52783 -0.626755
C  3.738865 -0.656894 -0.098456
C  2.915407 -1.602595 0.561846
C  -3.714126 -0.616513 1.517407
C  -3.149943 0.057407 -0.765202
C  -5.056023 -0.22532 1.303747
C  -4.487275 0.457286 -0.975405
C  -5.445524 0.312672 0.056418
C  5.190541 -0.911246 -0.220361
C  0.45199 2.843611 -0.319091
H  -1.131953 -1.125935 1.777977
H  -1.136719 -1.903727 0.152148
H  0.907938 -2.122834 1.189332
H  3.789634 1.261108 -1.137337
H  3.360361 -2.514131 0.979046
H  -3.415154 -1.022168 2.491992
H  -2.403637 0.178987 -1.557771
H  -5.790605 -0.332868 2.109425
H  -4.783464 0.879555 -1.942012
H  -6.48382 0.620503 -0.109595
H  5.530194 -1.87718 0.236255
H  1.03383 3.199355 0.552753
H  -0.48074 2.361933 0.015418
H  0.233238 3.687579 -0.990336
