program: Gaussian 09
title: 000075466
version: EM64L-G09RevD.01
frameworkgroup: C1[X(C6H4N2O)]
method: RPBEPBE
basis: SDD
operation: Freq
keyword: #pfreq=noraman
keyword: PBEPBE/SDD
title: #p freq=noraman PBEPBE/SDD
converged: NO NO NO NO
title: Mulliken charges:
elementType: O N N C C C C C C H H H H
charge: -0.293960 -0.038747 0.005520 0.303286 -0.271724 -0.239810 -0.204765 -0.140457 -0.172766 0.264654 0.288825 0.257092 0.242851
chargesum: 0.00000
title: Mulliken charges with hydrogens summed into heavy atoms:
elementType: O N N C C C C C C
charge: -0.293960 -0.038747 0.005520 0.303286 -0.007070 0.049015 0.052327 0.102394 -0.172766
polarizability: 1.21234477e+02 3.52602338e+00 9.01605773e+01 -1.12599364e-03 -1.94790798e-03 3.06595871e+01
1716.lowfreq: -8.2452 -0.0007 -0.0004 0.0006 3.7837 7.9285 119.7282 154.3338 215.6894
frequency: 119.7230 154.3295 215.6849 382.7367 389.9723 455.8566 491.5039 563.8985 564.0618 592.7503 720.8592 727.1477 767.1382 846.1187 860.2685 949.9836 978.4152 1033.1713 1090.9934 1157.5819 1201.0779 1257.0070 1268.5668 1286.7185 1404.9015 1474.7069 1529.9863 1607.9159 2183.5608 3164.5901 3173.4969 3192.8769 3211.1440
redmass: 5.8032 10.0287 6.2276 10.2074 4.5600 10.8221 3.5312 7.1341 4.2563 7.5164 6.1143 4.1979 1.3100 6.4892 1.4112 1.3599 1.3279 2.2511 2.1514 1.1342 2.4948 3.1925 5.9705 1.9048 2.0554 2.7016 6.7059 5.9235 12.6191 1.0879 1.0921 1.0986 1.0979
irintensity: 0.0469 0.7550 2.3681 2.9456 0.0133 1.2101 9.6943 0.1581 1.4545 3.5592 3.8707 1.6270 108.1901 12.3451 1.2140 3.9660 0.0042 6.0290 2.6474 5.0698 28.3609 21.5577 33.3865 17.8516 55.1885 13.2069 10.6422 9.4553 8.9536 1.9485 3.0319 2.6130 1.0515
temp: 298.150 k
press: 1.00000 atm
elementType: 8 7 7 6 6 6 6 6 6 1 1 1 1
symmnumber: 1
zpe: 233383.9 jmol-1
zpe.correction: 0.088891 hartree
zpe.thermalcorrener: 0.095916 hartree
zpe.thermalcorrenthalpy: 0.096861 hartree
zpe.thermalcorrgfe: 0.057276 hartree
zpe.sumelectzpe: -415.064323 hartree
zpe.sumelectthermal: -415.057298 hartree
zpe.sumelectthermalent: -415.056354 hartree
zpe.sumelectthermalfe: -415.095939 hartree
dipole: -6.4631 -2.5139 0.0001
dipole: 6.9348
quadrupole: -56.3790 -49.9723 -52.7785
quadrupole: -1.5285 0.0000 -0.0003
quadrupole: -3.3358 3.0709 0.2648 -1.5285 0.0000 -0.0003
hfenergy: -415.1532144 hartree
pointgroup: C01 [X(C6H4N2O1)]
dipole: -2.5018637 1.088388 -0.0000371 debye
dipolederiv: -0.4274623 0.3624147 -0.0000056 0.2503107 -0.8405464 0.0000104 -0.0000104 0.0000191 -0.279117 0.3080626 -0.4893413 0.0000015 -0.3613185 0.789508 -0.000007 -0.000013 -0.0000012 0.1338338 -0.2699543 -0.0847124 -0.0000303 -0.0635947 -0.2031531 -0.0000033 -0.0000142 0.0000006 -0.2271485 0.1506763 -0.1826302 0.0000155 0.2891102 -0.0732111 0.0000075 0.0000032 -0.0000075 0.0932182 0.1735093 0.1331254 0.0000016 -0.1657042 0.0658314 -0.0000057 -0.0000002 0.0000029 -0.078687 -0.1790057 0.3621121 -0.0000115 0.0483472 0.0365409 -0.0000125 0.0000036 -0.0000141 -0.14337 -0.2222765 -0.1926204 0.0000093 -0.1195475 -0.1232698 -0.0000121 0.0000147 -0.0000147 -0.1819256 0.1322672 -0.0341642 -0.0000025 0.0720693 0.2150441 -0.0000076 -0.0000138 -0.0000064 -0.0735918 0.1969084 0.1332334 0.0000284 0.0790971 -0.0313403 0.0000051 0.0000311 0. 0.05511 0.0773856 -0.0624694 -0.0000015 -0.0564216 0.0168516 0.0000038 -0.0000022 0.0000036 0.168461 0.0793863 0.0198516 0. -0.0194461 0.0402473 0.0000071 0.0000068 0.0000023 0.1918808 0.0360133 0.0632755 -0.0000061 0.0703129 -0.0027767 0.0000113 -0.0000058 0.0000131 0.1809325 -0.0555102 -0.0280748 0.0000012 -0.0232149 0.1102742 0.0000028 0.0000002 0.0000025 0.1604038 unknown
polarizability: 120.908862|-4.7376106|90.4861927|0.0010484|-0.0019907|30.6595871 unknown
InChI: InChI=1S/C6H4N2O/c7-5-6-3-1-2-4-8(6)9/h1-4H
charge 0 multiplicity 1
13 atoms
O  0.631359 -2.057844 0.000049
N  -0.119113 -0.970636 0.000025
N  3.085497 0.489213 0.000025
C  0.465231 0.315409 0.000014
C  -0.343429 1.473568 -0.000053
C  -1.513105 -1.066532 0.00003
C  -1.747207 1.369342 -0.000081
C  -2.321566 0.071381 -0.000027
C  1.894527 0.376385 0.00007
H  0.156141 2.445942 -0.000069
H  -1.885216 -2.092248 0.00008
H  -2.373846 2.264067 -0.000143
H  -3.406673 -0.066047 -0.00002
