program: Gaussian 09
title: 000075523
version: EM64L-G09RevD.01
frameworkgroup: C1[X(C24H16)]
method: RPBEPBE
basis: SDD
operation: Freq
keyword: #p
keyword: freq=noraman
keyword: PBEPBE/SDD
title: #p freq=noraman PBEPBE/SDD
converged: NO YES NO NO
title: Mulliken charges:
elementType: C C C C C C C C C C C C C C C C C C C C C C C C H H H H H H H H H H H H H H H H
charge: 0.252569 0.252579 -0.714606 -0.714613 0.122147 0.122148 -0.283624 -0.283622 0.389280 0.389281 0.497310 0.497309 -0.303934 -0.303946 -0.465831 -0.465833 -0.448445 -0.448446 -0.447022 -0.447020 -0.271735 -0.271728 -0.222678 -0.222679 0.244430 0.244438 0.244432 0.244438 0.246750 0.246750 0.245597 0.245597 0.238507 0.238506 0.237590 0.237590 0.219229 0.219230 0.220028 0.220028
chargesum: 0.00000
title: Mulliken charges with hydrogens summed into heavy atoms:
elementType: C C C C C C C C C C C C C C C C C C C C C C C C
charge: 0.252569 0.252579 -0.225738 -0.225744 0.122147 0.122148 -0.283624 -0.283622 0.389280 0.389281 0.497310 0.497309 -0.057184 -0.057196 -0.220234 -0.220236 -0.209938 -0.209940 -0.209432 -0.209430 -0.052506 -0.052498 -0.002650 -0.002651
polarizability: 5.12876863e+02 -9.44308659e+00 3.11822930e+02 3.42319249e-04 -3.65113473e-04 1.02442222e+02
1716.lowfreq: -0.0008 -0.0003 0.0004 5.0620 6.5638 8.1734 30.8840 53.9168 84.1994
frequency: 30.8840 53.9168 84.1994 111.1683 168.8890 175.2989 201.7564 204.8795 221.8858 238.3880 261.7790 266.8023 332.5445 420.7054 433.1815 438.3580 466.9117 471.6978 474.2420 488.0245 501.8347 511.3907 515.2106 542.0116 545.7839 595.2092 604.5473 616.0388 642.8224 657.9208 658.1634 665.4727 666.8886 750.3183 758.5564 764.2813 789.3050 789.8095 793.7827 794.0003 837.1262 841.3479 846.6512 885.7888 889.8034 910.5372 914.4614 953.5012 955.0425 965.0927 978.6209 978.6821 984.8035 985.2953 1007.4028 1018.7295 1023.2750 1032.5658 1048.2501 1053.6368 1062.1964 1113.6646 1142.8097 1147.6886 1148.2220 1176.4537 1179.2965 1189.3842 1191.0982 1201.1469 1216.6430 1239.6562 1240.2334 1266.4319 1270.6224 1276.1083 1279.2358 1368.9327 1371.2813 1395.5152 1398.0955 1417.5111 1418.7044 1433.3003 1438.2496 1459.9312 1460.4010 1464.2340 1467.8648 1496.0913 1500.6998 1588.8170 1589.2610 1597.3275 1607.7788 1623.7366 1626.2221 1642.5497 2969.3063 2970.1286 3015.4047 3015.5642 3120.3667 3120.3687 3121.6548 3121.7094 3134.0071 3134.0136 3144.6793 3144.7782 3153.0820 3153.2690 3181.6401 3181.8483
redmass: 5.0309 4.9664 5.1176 4.5282 3.6162 4.0395 6.6616 3.5286 3.7138 5.8359 2.4174 2.8087 3.5504 4.4298 4.3872 4.3271 3.1359 3.2377 4.7565 3.1636 7.3611 6.7936 2.5462 6.7189 7.1686 4.3903 3.4407 3.2749 6.0119 3.1607 3.1587 6.6387 5.2443 4.8443 1.2901 1.2105 1.6102 1.6242 5.2164 5.2419 2.9213 2.4604 5.4345 1.4859 1.3581 1.5760 1.5139 6.2303 1.8307 1.9028 1.3878 1.4399 1.3665 1.3901 4.3385 3.5241 3.3039 3.0209 2.4760 2.4793 2.0658 2.5754 2.1541 1.1103 1.1394 1.2100 1.2678 1.2306 1.2238 1.3657 1.4829 1.7492 1.6643 2.2368 2.5184 2.4400 3.1944 2.5353 2.9812 4.3047 4.8587 1.8329 1.9008 1.2726 1.2012 3.9580 4.8988 3.1553 3.2722 3.8206 4.3062 6.5133 5.9764 7.4964 8.1338 7.9276 7.5304 10.3844 1.0602 1.0603 1.1003 1.1002 1.0858 1.0858 1.0862 1.0862 1.0922 1.0922 1.0954 1.0954 1.0985 1.0985 1.0927 1.0928
irintensity: 0.0005 0.1837 0.0256 0.0000 0.0000 7.7014 0.0000 0.0000 0.0712 0.0000 24.0443 0.0000 0.0407 3.1833 0.0000 0.0000 0.0085 0.0000 4.1576 0.2717 0.2580 0.0000 0.0000 2.7553 0.0000 0.0000 2.5230 0.0000 2.2404 3.0342 0.0000 15.3592 0.0000 0.0000 16.4668 0.0000 157.1178 0.0003 2.3974 0.0000 0.0000 95.6035 4.1804 1.6357 0.0000 0.0000 4.6218 0.0000 5.3181 0.0000 0.9841 0.0000 5.6507 0.0000 3.0991 0.0000 2.4551 11.7777 0.0000 0.0000 5.8422 1.2605 0.0000 1.0210 0.0000 3.4655 0.0000 0.0000 6.0063 0.0000 4.2320 0.0000 7.8914 0.0000 1.7520 3.7201 0.0000 0.0000 58.0565 2.8223 0.0000 0.0554 0.0000 0.0000 7.2942 0.0000 0.1115 0.0000 8.1078 0.0000 6.2106 0.0011 47.3152 0.0000 46.5476 0.0000 13.4023 0.0000 0.0005 21.0445 16.9128 0.0120 0.6547 1.5343 3.9821 0.0166 1.2252 34.8955 82.3089 0.0959 105.8796 0.0069 0.0418 28.5527
temp: 298.150 k
press: 1.00000 atm
elementType: 6 6 6 6 6 6 6 6 6 6 6 6 6 6 6 6 6 6 6 6 6 6 6 6 1 1 1 1 1 1 1 1 1 1 1 1 1 1 1 1
symmnumber: 1
zpe: 832652.9 jmol-1
zpe.correction: 0.317141 hartree
zpe.thermalcorrener: 0.333711 hartree
zpe.thermalcorrenthalpy: 0.334655 hartree
zpe.thermalcorrgfe: 0.273272 hartree
zpe.sumelectzpe: -922.608109 hartree
zpe.sumelectthermal: -922.591540 hartree
zpe.sumelectthermalent: -922.590595 hartree
zpe.sumelectthermalfe: -922.651979 hartree
dipole: 0.0000 0.0000 0.0001
dipole: 0.0001
quadrupole: -123.0580 -118.6633 -147.6945
quadrupole: 0.6000 0.0001 -0.0001
quadrupole: 6.7473 11.1420 -17.8892 0.6000 0.0001 -0.0001
hfenergy: -922.9252502 hartree
pointgroup: C01 [X(C24H16)]
dipole: 0.0000035 0.0000058 -0.0000453 debye
polarizability: 512.876265|9.4494493|311.8235281|-0.0003423|-0.0003651|102.4422217 unknown
InChI: InChI=1S/C24H16/c1-5-15-7-3-11-19-21(13-17(9-1)23(15)19)22-14-18-10-2-6-16-8-4-12-20(22)24(16)18/h1-12H,13-14H2
charge 0 multiplicity 1
40 atoms
C  -0.672719 0.149947 -0.000033
C  0.672688 -0.14991 -0.000035
C  -1.246367 1.585487 -0.000006
C  1.246313 -1.585458 -0.00001
C  -1.815097 -0.789316 -0.000033
C  1.815084 0.789335 -0.000038
C  -3.022102 -0.009541 0.000026
C  3.022074 0.009542 0.000027
C  -2.758023 1.388185 0.000054
C  2.757972 -1.388184 0.000053
C  -4.338156 -0.562253 0.000042
C  4.338137 0.56223 0.000035
C  -1.94456 -2.192879 -0.000099
C  1.944575 2.1929 -0.000112
C  -3.830502 2.282309 0.000113
C  3.830436 -2.282323 0.000108
C  -4.428149 -1.995261 -0.000014
C  4.428159 1.995234 -0.000023
C  -5.426671 0.374179 0.000105
C  5.426639 -0.374221 0.000092
C  -3.256315 -2.770096 -0.000077
C  3.256338 2.770092 -0.0001
C  -5.167425 1.753555 0.000133
C  5.167372 -1.75359 0.000133
H  -0.905226 2.152836 -0.88884
H  -0.905121 2.152858 0.888768
H  0.905161 -2.152809 -0.888837
H  0.905057 -2.152815 0.888768
H  -1.078069 -2.857908 -0.000168
H  1.0781 2.857946 -0.000194
H  -3.675561 3.36707 0.000139
H  3.675487 -3.367083 0.000134
H  -5.410259 -2.482752 -0.000003
H  5.41028 2.482707 -0.000016
H  -6.460676 0.00948 0.000121
H  6.460648 -0.009532 0.000105
H  -3.34323 -3.86315 -0.000121
H  3.343276 3.863144 -0.000154
H  -6.010448 2.45457 0.000179
H  6.010378 -2.454624 0.000178
