program: Gaussian 09
title: 000075451
version: EM64L-G09RevD.01
frameworkgroup: C1[X(C9H11NO2)]
method: RPBEPBE
basis: SDD
operation: Freq
keyword: #p
keyword: freq=noraman
keyword: PBEPBE/SDD
title: #p freq=noraman PBEPBE/SDD
converged: NO YES NO NO
title: Mulliken charges:
elementType: O O N C C C C C C C C C H H H H H H H H H H H
charge: -0.415882 -0.235523 -0.696708 -0.565454 0.506888 -0.482361 -0.397621 -0.398602 -0.412059 -0.411773 0.480661 0.185755 0.227079 0.228503 0.264065 0.263745 0.226913 0.227147 0.212896 0.212817 0.302680 0.302674 0.374163
chargesum: 0.00000
title: Mulliken charges with hydrogens summed into heavy atoms:
elementType: O O N C C C C C C C C C
charge: -0.041719 -0.235523 -0.091355 -0.109872 0.506888 0.045449 -0.170708 -0.171455 -0.199164 -0.198957 0.480661 0.185755
polarizability: 1.61380562e+02 4.62640199e-01 9.75798440e+01 -1.35858585e+01 5.85145802e-01 7.24215928e+01
1716.lowfreq: -5.6234 -0.0006 -0.0006 -0.0003 7.8107 10.7948 22.0178 32.0013 58.5736
frequency: 15.8544 31.8263 58.5551 73.8439 159.0830 195.5062 288.2710 324.9994 337.3415 362.5083 391.0524 409.4903 443.7398 486.4600 504.2774 533.6127 586.7431 639.4336 640.9342 725.9646 767.0755 776.5340 816.9577 819.6786 829.9005 880.9455 938.0395 951.9196 991.1718 1000.2232 1020.4666 1025.7923 1079.4246 1125.7347 1155.3891 1188.7805 1222.4301 1239.4923 1270.6428 1303.5125 1314.0316 1321.2585 1367.1399 1385.4089 1434.5756 1437.8128 1474.6022 1521.1130 1581.9106 1633.8961 1645.5608 1661.7931 2997.6148 3007.7461 3041.3990 3069.8588 3105.1024 3106.8803 3127.9803 3134.9699 3506.5078 3569.2326 3709.5040
redmass: 7.6184 3.8282 5.4382 2.2520 5.2387 6.8481 2.4933 1.4557 3.3780 1.0489 2.5308 2.6898 4.5888 5.2429 1.7653 2.4845 4.6047 6.5279 1.3160 3.3276 4.3705 1.3840 1.2613 1.8792 5.5870 3.3344 1.4405 1.3571 1.7810 2.8835 3.6122 1.4697 2.4786 1.2676 1.1537 1.0948 2.3631 1.4441 1.1812 1.7148 3.3161 1.2498 1.7912 5.2879 3.2311 1.0819 1.0945 3.1307 6.6400 1.8360 2.1210 8.0984 1.0614 1.0600 1.0986 1.1027 1.0867 1.0866 1.0961 1.0971 1.0639 1.0448 1.1040
irintensity: 0.5975 0.1662 1.2330 0.4900 4.7317 2.1227 1.3137 230.7104 91.0363 0.9609 1.9934 0.0630 11.7894 33.8036 26.5836 27.1135 18.7219 0.5513 129.3386 0.3760 0.8843 8.7781 0.1717 71.1513 5.3585 4.7460 0.3466 0.0017 0.8605 1.5044 199.7307 2.0089 106.6634 11.0452 9.7308 15.5014 0.5114 0.7422 0.2367 61.9775 46.8480 0.4614 62.9889 10.1371 0.2445 27.9095 14.7790 135.9299 3.6287 1.7637 275.2996 218.6220 6.8765 26.0940 0.0253 19.5633 1.0534 38.1483 51.0245 2.8728 14.2218 66.7871 19.7135
temp: 298.150 k
press: 1.00000 atm
elementType: 8 8 7 6 6 6 6 6 6 6 6 6 1 1 1 1 1 1 1 1 1 1 1
symmnumber: 1
zpe: 483108.9 jmol-1
zpe.correction: 0.184006 hartree
zpe.thermalcorrener: 0.195953 hartree
zpe.thermalcorrenthalpy: 0.196897 hartree
zpe.thermalcorrgfe: 0.143613 hartree
zpe.sumelectzpe: -553.885058 hartree
zpe.sumelectthermal: -553.873111 hartree
zpe.sumelectthermalent: -553.872167 hartree
zpe.sumelectthermalfe: -553.925452 hartree
dipole: -2.8975 -0.1006 1.8548
dipole: 3.4418
quadrupole: -51.2367 -63.5192 -79.3184
quadrupole: -0.2710 2.1978 0.7485
quadrupole: 13.4547 1.1722 -14.6270 -0.2710 2.1978 0.7485
hfenergy: -554.0690644 hartree
pointgroup: C01 [X(C9H11N1O2)]
dipole: 1.1385336 0.0393777 0.7319902 debye
dipolederiv: -0.7791612 0.0365348 0.5336089 0.0393724 -0.4289212 -0.0342745 0.5514349 -0.0341013 -0.9282025 -0.7815022 -0.0174889 -0.2629617 0.0020009 -0.3078323 -0.0416294 0.0149341 -0.0409582 -0.9310654 -1.5916173 -0.0032194 -0.1656216 -0.0052845 -0.085994 -0.0272359 -0.2135662 -0.0270672 -0.8002488 0.1367579 0.0001519 -0.0009935 0.0007509 0.1376612 -0.0020094 0.0770433 -0.0010242 0.1270347 0.0927493 -0.0000974 0.0220719 -0.0002295 -0.2701763 0.0056573 -0.0032586 0.005849 -0.1280275 -0.4281554 -0.0010028 -0.0624478 -0.0080679 0.1391136 -0.0099449 -0.2821212 -0.0095466 -0.0500056 0.1245934 0.1532145 0.0710293 -0.0096006 0.1663666 -0.0250339 0.0851883 0.0265955 -0.1172005 0.1239523 -0.1473243 0.0825037 0.0159043 0.1652457 0.0026433 0.0840374 -0.0489575 -0.1155345 -0.3927895 -0.0850075 -0.0196368 0.3930485 0.0692149 0.0711758 -0.0540003 -0.0375661 -0.2357355 -0.394329 0.0851767 -0.0263705 -0.3943908 0.0660348 -0.0945984 -0.0232206 0.0139683 -0.2311132 1.6152881 0.0095582 0.3366533 0.0116666 -0.0579927 0.0101185 0.3784413 0.0100686 0.2221704 1.4703919 -0.0113644 -0.1195256 -0.0242454 0.1991178 0.0893308 -0.227241 0.0879928 1.513558 0.021123 0.0160263 -0.0239936 0.0668231 -0.0497012 0.1100913 -0.0140284 0.0687297 0.0022741 0.0234645 -0.0182216 -0.0233974 -0.0669406 -0.0614555 -0.1031688 -0.0088771 -0.0627395 0.0174337 0.0867237 0.0275431 -0.0099213 0.0132859 0.0009665 0.1011718 0.0127638 0.0657217 0.0300842 0.0862064 -0.0286262 -0.0066271 -0.0144161 -0.0131744 -0.0976442 0.0164489 -0.0627526 0.0432024 0.0388217 0.1057471 -0.0395168 0.1015693 -0.063358 0.0303513 -0.0394018 0.0353957 0.1247396 0.0383818 -0.1085226 -0.0312652 -0.1045981 -0.0664092 -0.0150644 -0.0314035 -0.0202895 0.1288673 -0.0145499 -0.1130918 -0.0356937 -0.1052689 -0.0743 -0.0118193 -0.0445479 -0.0150917 0.1579708 -0.0137621 0.1098092 -0.0443556 0.1011832 -0.0716102 0.0299985 -0.0527233 0.0334526 0.154242 0.216256 -0.0122624 -0.0449626 -0.0285818 0.1112591 0.0057827 -0.0417497 0.0077321 0.3774832 0.2163692 0.0083076 -0.0456392 0.0248993 0.1116902 0.0148999 -0.0440826 0.0128863 0.3769525 0.1047872 -0.0058402 -0.082937 -0.0088801 0.3842546 -0.0087981 -0.1400697 -0.008298 0.2611206 unknown
polarizability: 161.3253589|0.3874832|97.575414|13.7679131|-0.6673695|72.4812262 unknown
InChI: InChI=1S/C9H11NO2/c10-8-4-1-7(2-5-8)3-6-9(11)12/h1-2,4-5,11H,3,6,10H2
charge 0 multiplicity 1
23 atoms
O  -4.252381 0.093837 1.355652
O  -4.056267 -0.063143 -0.950881
N  4.4815 0.016608 0.568472
C  -1.146389 -0.025856 -0.81972
C  0.338666 -0.016382 -0.488548
C  -2.015884 0.028807 0.460444
C  1.055959 1.200087 -0.354195
C  1.051271 -1.221604 -0.259945
C  2.420727 1.222475 -0.005813
C  2.415913 -1.221811 0.089571
C  3.126751 0.00609 0.225034
C  -3.503357 0.012299 0.169518
H  -1.408457 0.834317 -1.462706
H  -1.414281 -0.933185 -1.391379
H  -1.784807 -0.823213 1.128618
H  -1.788678 0.93527 1.05377
H  0.538248 2.151448 -0.534436
H  0.530192 -2.182266 -0.3657
H  2.948436 2.180542 0.082749
H  2.939836 -2.172057 0.253126
H  4.985009 -0.850578 0.727602
H  4.988581 0.891386 0.660563
H  -5.222588 0.078427 1.129702
