program: Gaussian 09
title: 000075449
version: EM64L-G09RevD.01
frameworkgroup: C1[X(C7H4ClNS)]
method: RPBEPBE
basis: SDD
operation: Freq
keyword: #p
keyword: freq=noraman
keyword: PBEPBE/SDD
title: #p freq=noraman PBEPBE/SDD
converged: NO YES NO NO
title: Mulliken charges:
elementType: Cl S N C C C C C C C H H H H
charge: -0.048004 0.150418 0.300252 0.514826 -0.371047 -0.393745 -0.033457 -0.163545 -0.242473 -0.763426 0.282507 0.261510 0.242654 0.263530
chargesum: 0.00000
title: Mulliken charges with hydrogens summed into heavy atoms:
elementType: Cl S N C C C C C C C
charge: -0.048004 0.150418 0.300252 0.514826 -0.088539 -0.132235 -0.033457 0.079109 0.021056 -0.763426
polarizability: 2.18766891e+02 1.53528304e+01 1.01553531e+02 4.75193138e-02 -8.41496719e-03 3.81513625e+01
1716.lowfreq: -2.8781 -0.0019 -0.0015 0.0016 5.1870 8.6174 24.7418 68.6804 177.1728
frequency: 24.6076 68.6348 177.1722 224.2873 249.4543 347.4544 377.7370 400.4436 419.6870 441.7829 453.3791 567.9206 646.7200 679.4735 718.6565 787.2766 881.2124 901.3878 937.0582 977.1934 979.5609 1068.4049 1090.4004 1174.7975 1256.9254 1291.7685 1363.3082 1422.7741 1463.2096 1562.3770 1599.3233 2196.6819 3150.5401 3172.1432 3180.6121 3184.3269
redmass: 12.6962 7.7818 5.6370 11.4684 5.4923 11.9468 8.7843 10.7350 7.2645 3.6497 6.5905 5.5116 7.5210 2.1857 9.9899 1.3915 1.4632 1.4179 7.0440 1.3375 5.8864 2.0095 1.5484 1.0808 2.2067 1.7058 6.6788 3.2939 2.6151 6.5019 6.8129 12.8892 1.0877 1.0936 1.0945 1.0986
irintensity: 0.1752 0.0060 0.0768 0.6872 0.0007 2.7138 1.8133 5.1393 0.2703 6.2828 1.3068 0.0337 6.0341 27.9141 111.4797 56.9803 26.1005 4.8764 21.3521 1.0820 4.4651 23.2268 4.4588 0.7741 6.6635 1.1954 0.8395 8.5890 69.9882 70.8925 120.7435 1421.4935 7.2545 2.3133 1.0274 3.7951
temp: 298.150 k
press: 1.00000 atm
elementType: 17 16 7 6 6 6 6 6 6 6 1 1 1 1
symmnumber: 1
zpe: 235895.8 jmol-1
zpe.correction: 0.089848 hartree
zpe.thermalcorrener: 0.098790 hartree
zpe.thermalcorrenthalpy: 0.099734 hartree
zpe.thermalcorrgfe: 0.053430 hartree
zpe.sumelectzpe: -1181.326945 hartree
zpe.sumelectthermal: -1181.318004 hartree
zpe.sumelectthermalent: -1181.317060 hartree
zpe.sumelectthermalfe: -1181.363364 hartree
dipole: 1.8613 2.2753 -0.0002
dipole: 2.9397
quadrupole: -81.6301 -64.6141 -74.2519
quadrupole: 3.0944 -0.0117 -0.0115
quadrupole: -8.1314 8.8846 -0.7532 3.0944 -0.0117 -0.0115
hfenergy: -1181.4167934 hartree
pointgroup: C01[X(C7H4Cl1N1S1)]
dipole: -0.7517084 -0.8701238 -0.1242117 debye
dipolederiv: -0.5426365 0.3026106 0.0239943 0.4384086 -0.4515883 -0.0353793 0.0402191 -0.0387818 -0.0676024 -1.3422464 -0.2531091 -0.0621592 -0.2966578 -0.1152727 -0.0140806 -0.0666494 -0.0128684 -0.0623666 -2.6682111 -0.4861104 -0.1237848 -0.5802945 -0.264008 -0.0431669 -0.1307998 -0.0399044 -0.0327943 1.6104811 0.2438406 0.0689909 0.2551215 0.3430344 0.0349942 0.0696169 0.0345364 0.1153892 -0.5643417 0.0718914 -0.0024788 0.2221374 -0.1377318 0.0052135 0.0149136 0.0009863 -0.1303087 -0.3149008 -0.0868053 -0.0138214 -0.2415958 -0.0939029 0.0035459 -0.0334429 0.0075941 -0.1756835 0.8487985 -0.4694042 -0.033161 -0.6944058 0.6971891 0.0709247 -0.0598083 0.0766386 -0.0322244 0.1779375 -0.0183612 0.005781 0.075516 0.1397695 0.0336591 0.0174733 0.0313053 -0.1165409 -0.2677811 0.1069056 0.0094907 0.1669584 -0.2852514 -0.0145442 0.0164668 -0.0161198 -0.1298209 2.9293313 0.602709 0.1439832 0.6951684 0.096172 0.0353816 0.1522203 0.0325849 -0.0520684 0.0949678 -0.029425 -0.0059459 -0.0447229 0.0156292 -0.0212505 -0.0078782 -0.0208749 0.1785404 0.018053 0.0811019 0.005524 0.0754149 0.0326842 -0.0155787 0.004796 -0.0154023 0.1756252 0.0479669 -0.038706 -0.0077002 -0.0555251 -0.0759391 -0.0302309 -0.009742 -0.0298874 0.157213 -0.0274185 -0.0271378 -0.0087128 -0.0155233 0.0992157 -0.0094878 -0.0073854 -0.0098063 0.1726423 unknown
polarizability: 219.2736314|12.0981831|99.9557136|6.0705684|7.7636137|39.2424396 unknown
InChI: InChI=1S/C7H4ClNS/c8-6-2-1-3-7(4-6)9-5-10/h1-4H
charge 0 multiplicity 1
14 atoms
Cl -3.1282 1.838131 0.14342
S  4.538785 0.765711 0.210036
N  1.780107 0.126502 0.068888
C  0.439599 -0.183849 -0.00537
C  -0.529081 0.854924 0.094583
C  0.027572 -1.534656 -0.180367
C  -1.888141 0.510309 0.016064
C  -1.346823 -1.836213 -0.25382
C  -2.32484 -0.818409 -0.156773
C  2.954728 0.399116 0.128504
H  -0.212248 1.892078 0.228941
H  0.783178 -2.32171 -0.25558
H  -1.665804 -2.874599 -0.388539
H  -3.391334 -1.051534 -0.213886
