program: Gaussian 16
title: Cl3-c54h18.plan opt
version: ES64L-G16RevC.02
basis: CBSB1
frameworkgroup: C2V[C2(Cl),SGV(C54H18)]
method: RHF
basis: STO-3G
operation: FOpt
keyword: #P
keyword: opt
keyword: EmpiricalDispersion=GD3BJ
keyword: integral(grid=ultrafinegrid)
keyword: GFInputpop=full
keyword: IOP(3/74=-78)
keyword: IOP(6/7=3)
keyword: IOP(3/5=10)
keyword: IOP(3/175=01217700)
keyword: IOP(3/177=414500)
keyword: IOP(3/178=4859300)
keyword: SCF=YQC
title: #P opt EmpiricalDispersion=GD3BJ integral(grid=ultrafinegrid) GFInput
nucrepener: 6896.2660772930
basis: NPDir=0 NMtPBC= 1 NCelOv= 1 NCel= 1 NClECP= 1 NCelD= 1
basis: NCelK= 1 NCelE2= 1 NClLst= 1 CellRange= 0.0.
basis: One-electron integrals computed using PRISM.
basis: One-electron integral symmetry used in STVInt
basis: NBasis= 1998 RedAO= T EigKep= 1.15D-06 NBF= 689 311 319 679
basis: NBsUse= 1928 1.00D-06 EigRej= 9.81D-07 NBFU= 658 310 319 641
converged: YES YES YES YES
title: Mulliken charges:
elementType: C C C C C C C C C C C C C C C C C C C C C C C C C C C C C C C C C C C C C C C C C C C C C C C C C C C C C C H H H H H H H H H H H H H H H H H H Cl
charge: -0.038902 0.054974 0.054974 -0.038902 0.028845 0.028845 0.173274 -0.162096 0.164107 0.403376 -0.321980 0.413390 0.427218 0.122462 0.340618 0.088893 -0.288869 -0.490660 -0.213037 -0.402384 -0.385946 -0.321980 0.164107 -0.159068 0.173274 -0.162096 0.088893 -0.179625 0.122462 -0.179625 -0.402384 0.413390 -0.490660 0.403376 -0.213037 0.340618 -0.288869 0.427218 0.127020 -0.472283 0.179743 -0.024229 -0.159068 0.106659 0.173861 0.173861 -0.270490 -0.270490 0.127020 -0.024229 0.179743 0.106659 -0.472283 -0.385946 0.107100 0.089092 -0.004859 0.092001 0.080199 0.025204 0.091955 0.088904 0.025204 0.029121 0.088904 0.091955 0.080199 -0.004859 0.092001 0.029121 0.089092 0.107100 -0.987171
chargesum: -1.00000
charge: -0.027980 0.048526 0.048526 -0.027980 0.020631 0.020631 0.142919 -0.176578 0.126371 0.528505 -0.342626 0.435452 0.416046 0.102501 0.496080 0.091187 -0.410779 -0.389440 -0.394534 -0.374025 -0.374585 -0.342626 0.126371 -0.204548 0.142919 -0.176578 0.091187 -0.197892 0.102501 -0.197892 -0.374025 0.435452 -0.389440 0.528505 -0.394534 0.496080 -0.410779 0.416046 0.205055 -0.391672 0.177311 0.089025 -0.204548 0.095223 -0.058769 -0.058769 -0.263169 -0.263169 0.205055 0.089025 0.177311 0.095223 -0.391672 -0.374585 0.107887 0.089154 0.012630 0.093332 0.067518 0.026850 0.093749 0.088162 0.026850 0.028983 0.088162 0.093749 0.067518 0.012630 0.093332 0.028983 0.089154 0.107887 -0.953000
dipole: 0.0000 -0.0000 -32.2466
dipole: 32.2466
quadrupole: -332.3751 -292.7052 -621.4970
quadrupole: -0.0000 -0.0000 0.0000
quadrupole: 83.1507 122.8206 -205.9712 -0.0000 -0.0000 0.0000
hfenergy: -2526.1341131 hartree
pointgroup: C02V [C2(Cl1),SGV(C54H18)]
dipole: -12.6868061 0. 0. debye
InChI: InChI=1/54C.Cl.18H
charge -1 multiplicity 1
73 atoms
C  -0.01330107 1.40267355 0.0000
C  1.2020324 0.70171584 0.0000
C  1.2020324 -0.70171584 0.0000
C  -0.01330107 -1.40267355 0.0000
C  -1.22863143 -0.70127669 0.0000
C  -1.22863143 0.70127669 0.0000
C  -2.4547896 2.81414708 0.0000
C  -2.45585876 1.40984225 0.0000
C  2.42839793 -2.81136785 0.0000
C  -3.68036592 3.51548113 0.0000
C  -4.87050608 2.80418367 0.0000
C  3.65625047 -3.5092605 0.0000
C  -1.22246173 4.9323235 0.0000
C  -1.22897057 3.52098517 0.0000
C  1.1998815 -4.93201852 0.0000
C  1.20448245 -3.51915506 0.0000
C  -2.47654282 5.61335232 0.0000
C  -3.64256546 4.94234778 0.0000
C  2.45584068 -5.61225237 0.0000
C  3.61888088 -4.93689381 0.0000
C  -0.01064287 5.60632427 0.0000
C  -4.87050608 -2.80418367 0.0000
C  2.42839793 2.81136785 0.0000
C  2.42985733 1.40885609 0.0000
C  -2.4547896 -2.81414708 0.0000
C  -2.45585876 -1.40984225 0.0000
C  1.20448245 3.51915506 0.0000
C  -0.01300982 2.81956353 0.0000
C  -1.22897057 -3.52098517 0.0000
C  -0.01300982 -2.81956353 0.0000
C  3.61888088 4.93689381 0.0000
C  3.65625047 3.5092605 0.0000
C  -3.64256546 -4.94234778 0.0000
C  -3.68036592 -3.51548113 0.0000
C  2.45584068 5.61225237 0.0000
C  1.1998815 4.93201852 0.0000
C  -2.47654282 -5.61335232 0.0000
C  -1.22246173 -4.9323235 0.0000
C  4.87031358 -1.410641 0.0000
C  4.84534333 -2.79912004 0.0000
C  -4.89134096 1.41875669 0.0000
C  3.64485566 -0.70653077 0.0000
C  2.42985733 -1.40885609 0.0000
C  -3.67144763 0.70744103 0.0000
C  6.08946988 0.67301674 0.0000
C  6.08946988 -0.67301674 0.0000
C  -6.10856391 -0.67240457 0.0000
C  -6.10856391 0.67240457 0.0000
C  4.87031358 1.410641 0.0000
C  3.64485566 0.70653077 0.0000
C  -4.89134096 -1.41875669 0.0000
C  -3.67144763 -0.70744103 0.0000
C  4.84534333 2.79912004 0.0000
C  -0.01064287 -5.60632427 0.0000
H  4.55827794 5.46987564 0.0000
H  -4.58003187 -5.47908995 0.0000
H  7.05116342 1.1700742 0.0000
H  -7.0417339 -1.21668948 0.0000
H  5.78473264 3.33284839 0.0000
H  -0.01023767 -6.68748102 0.0000
H  -2.471058 6.6936753 0.0000
H  2.45267283 -6.69244427 0.0000
H  -0.01023767 6.68748102 0.0000
H  -5.80673609 -3.34485237 0.0000
H  2.45267283 6.69244427 0.0000
H  -2.471058 -6.6936753 0.0000
H  5.78473264 -3.33284839 0.0000
H  7.05116342 -1.1700742 0.0000
H  -7.0417339 1.21668948 0.0000
H  -5.80673609 3.34485237 0.0000
H  -4.58003187 5.47908995 0.0000
H  4.55827794 -5.46987564 0.0000
Cl 9.41936318 0.0000 0.0000
