program: Gaussian 16
title: Cl4-c54h18.plan opt
version: ES64L-G16RevC.02
basis: CBSB1
frameworkgroup: CS[SG(C54H18Cl)]
method: RHF
basis: STO-3G
operation: FOpt
keyword: #P
keyword: opt
keyword: EmpiricalDispersion=GD3BJ
keyword: integral(grid=ultrafinegrid)
keyword: GFInputpop=full
keyword: IOP(3/74=-78)
keyword: IOP(6/7=3)
keyword: IOP(3/5=10)
keyword: IOP(3/175=01217700)
keyword: IOP(3/177=414500)
keyword: IOP(3/178=4859300)
keyword: SCF=YQC
title: #P opt EmpiricalDispersion=GD3BJ integral(grid=ultrafinegrid) GFInput
nucrepener: 6901.2453603109
basis: NPDir=0 NMtPBC= 1 NCelOv= 1 NCel= 1 NClECP= 1 NCelD= 1
basis: NCelK= 1 NCelE2= 1 NClLst= 1 CellRange= 0.0.
basis: One-electron integrals computed using PRISM.
basis: One-electron integral symmetry used in STVInt
basis: NBasis= 1998 RedAO= T EigKep= 1.15D-06 NBF= 1368 630
basis: NBsUse= 1928 1.00D-06 EigRej= 9.80D-07 NBFU= 1299 629
converged: YES YES YES YES
title: Mulliken charges:
elementType: C C C C C C C C C C C C C C C C C C C C C C C C C C C C C C C C C C C C C C C C C C C C C C C C C C C C C C H H H H H H H H H H H H H H H H H H Cl
charge: 0.054524 -0.037501 0.054511 0.003048 0.035770 0.003037 0.124829 -0.180305 0.107315 0.417190 -0.407375 0.314299 0.314263 0.107335 0.417149 0.124851 -0.369559 -0.299210 -0.299169 -0.369595 -0.402111 -0.425390 0.211526 -0.115044 0.142935 -0.227421 0.142726 -0.167202 0.121149 -0.180341 -0.441240 0.247824 -0.304058 0.413765 -0.440036 0.365265 -0.318759 0.280028 0.365281 -0.402137 0.280036 0.142711 -0.167168 0.121131 -0.441225 -0.440045 -0.304025 -0.318759 0.247821 0.211541 0.413745 0.142945 0.284447 -0.407346 0.118799 0.088654 0.118798 0.088653 -0.057149 0.023908 0.094593 0.087033 0.024905 0.026284 0.102236 0.093372 0.024905 0.102237 0.093373 0.023908 0.087035 0.094594 -0.984114
chargesum: -1.00000
charge: 0.032129 -0.035078 0.032084 0.020596 0.015147 0.020559 0.119877 -0.189181 0.113204 0.354718 -0.401106 0.321067 0.321063 0.113209 0.354749 0.119890 -0.369638 -0.284208 -0.284189 -0.369698 -0.414096 -0.342222 0.227671 -0.129122 0.143053 -0.234503 0.143804 -0.214741 0.085659 -0.189179 -0.536976 0.179477 -0.354155 0.394943 -0.297422 0.481540 -0.288666 0.356724 0.481638 -0.414094 0.356760 0.143823 -0.214723 0.085658 -0.537059 -0.297457 -0.354210 -0.288669 0.179555 0.227654 0.395000 0.143048 0.199647 -0.401143 0.136890 0.089116 0.136889 0.089115 -0.112200 0.025816 0.094586 0.089143 0.027296 0.027857 0.102223 0.094508 0.027296 0.102224 0.094508 0.025816 0.089143 0.094585 -0.957218
dipole: -28.7594 -0.0004 0.0000
dipole: 28.7594
quadrupole: -577.3163 -296.9345 -332.3712
quadrupole: -0.0042 0.0000 0.0000
quadrupole: -175.1090 105.2728 69.8361 -0.0042 0.0000 0.0000
hfenergy: -2526.1403035 hartree
pointgroup: CS [SG(C54H18Cl1)]
dipole: -9.7990073 -5.6572705 0. debye
InChI: InChI=1/54C.Cl.18H
charge -1 multiplicity 1
73 atoms
C  -0.0098 1.39766123 0.0000
C  1.20553665 0.69602021 0.0000
C  1.20551036 -0.70731202 0.0000
C  -0.0091386 -1.40822818 0.0000
C  -1.22444485 -0.70693152 0.0000
C  -1.22413538 0.69620215 0.0000
C  -2.44849816 2.80984046 0.0000
C  -2.4510981 1.40531425 0.0000
C  2.43353295 -2.81698974 0.0000
C  -3.67400565 3.511909 0.0000
C  -4.86395172 2.80078074 0.0000
C  3.66132123 -3.51360515 0.0000
C  -1.2122213 4.92759963 0.0000
C  -1.22282707 3.51599641 0.0000
C  1.20440584 -4.93772921 0.0000
C  1.2091486 -3.52537448 0.0000
C  -2.4669691 5.60884674 0.0000
C  -3.63387822 4.93920416 0.0000
C  2.46054434 -5.61662421 0.0000
C  3.62392597 -4.94087201 0.0000
C  -0.00006238 5.60067776 0.0000
C  -4.86618869 -2.80949585 0.0000
C  2.43247801 2.80562709 0.0000
C  2.43027703 1.40312411 0.0000
C  -2.45037201 -2.81958745 0.0000
C  -2.45116489 -1.41517921 0.0000
C  1.20959377 3.51409897 0.0000
C  -0.00766859 2.81494312 0.0000
C  -1.22447242 -3.52683282 0.0000
C  -0.00850834 -2.82536472 0.0000
C  3.63558696 4.93028998 0.0000
C  3.65783032 3.50255937 0.0000
C  -3.63783561 -4.94772014 0.0000
C  -3.67615493 -3.52044254 0.0000
C  2.47074948 5.60599761 0.0000
C  1.21321909 4.92728064 0.0000
C  -2.47241526 -5.61943634 0.0000
C  -1.2177298 -4.9387112 0.0000
C  4.87376401 -1.41295235 0.0000
C  4.85030318 -2.80038348 0.0000
C  -4.88592136 1.41476846 0.0000
C  3.64809853 -0.70950333 0.0000
C  2.43398042 -1.41410531 0.0000
C  -3.66656875 0.70299177 0.0000
C  6.08755339 0.68337597 0.0000
C  6.09031515 -0.66325639 0.0000
C  -6.103773 -0.6766012 0.0000
C  -6.10278854 0.66854032 0.0000
C  4.86222148 1.41649899 0.0000
C  3.64598376 0.70378062 0.0000
C  -4.8868724 -1.42342345 0.0000
C  -3.66702338 -0.71229063 0.0000
C  4.85559534 2.80338051 0.0000
C  -0.00642187 -5.61268936 0.0000
H  4.58957189 5.43910727 0.0000
H  -4.57544493 -5.48433808 0.0000
H  7.00519343 1.25514679 0.0000
H  -7.03730172 -1.22028694 0.0000
H  5.80130485 3.34937639 0.0000
H  -0.00603001 -6.69390919 0.0000
H  -2.46084887 6.68917307 0.0000
H  2.45824069 -6.69692306 0.0000
H  0.00047707 6.6817874 0.0000
H  -5.80248353 -3.35006673 0.0000
H  2.46773142 6.68615248 0.0000
H  -2.46753904 -6.69980236 0.0000
H  5.78684179 -3.34047031 0.0000
H  7.0242486 -1.20594556 0.0000
H  -7.0359758 1.2129448 0.0000
H  -5.80012043 3.34172883 0.0000
H  -4.57059688 5.47735765 0.0000
H  4.56257664 -5.4757341 0.0000
Cl 7.74345566 4.47054165 0.0000
