program: Gaussian 16
title: Cl2-c24h12 opt
version: ES64L-G16RevC.02
basis: CBSB1
frameworkgroup: C1[X(C24H12Cl)]
method: RHF
basis: STO-3G
operation: FOpt
keyword: #P
keyword: opt
keyword: EmpiricalDispersion=GD3BJ
keyword: integral(grid=ultrafinegrid)
keyword: GFInputpop=full
keyword: IOP(3/74=-78)
keyword: IOP(6/7=3)
keyword: IOP(3/5=10)
keyword: IOP(3/175=01217700)
keyword: IOP(3/177=414500)
keyword: IOP(3/178=4859300)
title: #P opt EmpiricalDispersion=GD3BJ integral(grid=ultrafinegrid) GFInput
nucrepener: 2217.7848906507
basis: NPDir=0 NMtPBC= 1 NCelOv= 1 NCel= 1 NClECP= 1 NCelD= 1
basis: NCelK= 1 NCelE2= 1 NClLst= 1 CellRange= 0.0.
basis: One-electron integrals computed using PRISM.
basis: One-electron integral symmetry used in STVInt
basis: NBasis= 942 RedAO= T EigKep= 1.42D-06 NBF= 942
basis: NBsUse= 922 1.00D-06 EigRej= 6.64D-07 NBFU= 922
converged: YES YES YES YES
title: Mulliken charges:
elementType: C C C C C C C C C C C C C C C C C C C C C C C C H H H H H H H H H H H H Cl
charge: 0.641763 0.641762 -0.032953 0.060284 0.060284 -0.032953 -0.625853 0.746696 -0.614175 -0.634079 -0.682699 -0.174276 0.692522 -0.548876 0.823671 -0.174276 0.692521 -0.548876 0.823671 -0.625853 0.746696 -0.614174 -0.634079 -0.682700 0.102467 0.070851 0.081455 0.067057 0.081455 0.067057 0.102467 0.070851 0.065912 0.071734 0.065912 0.071734 -1.223002
chargesum: -1.00000
charge: 0.086540 0.187241 0.086489 0.102577 0.110782 0.102555 -0.542447 0.822855 -0.683995 -0.683925 -0.500072 -0.408028 0.728725 -0.500095 0.787453 -0.635998 0.935096 -0.545323 0.822873 -0.635984 0.934983 -0.545319 -0.407966 -0.542380 0.004493 0.077307 0.004486 0.076320 0.080444 0.077306 0.120595 0.077639 0.120615 0.077638 0.076317 0.080449 -0.950245
dipole: 21.9213 -0.0003 0.0035
dipole: 21.9213
quadrupole: -300.1449 -143.5840 -162.3599
quadrupole: 0.0020 -0.0252 -0.0002
quadrupole: -98.1153 58.4456 39.6697 0.0020 -0.0252 -0.0002
hfenergy: -1380.6814512 hartree
pointgroup: C01 [X(C24H12Cl1)]
dipole: -7.3964518 -4.3533125 -0.8505056 debye
InChI: InChI=1/24C.Cl.12H
charge -1 multiplicity 1
37 atoms
C  -0.13981975 1.37477059 0.08279689
C  1.08476433 0.6760933 0.17539574
C  1.09726688 -0.73596524 0.12818656
C  -0.11419532 -1.45131606 -0.01163069
C  -1.34164771 -0.75202881 -0.10445235
C  -1.35327992 0.66284956 -0.05705132
C  -2.54933214 2.76733926 -0.09862943
C  -2.56811441 1.35635953 -0.14880607
C  2.29801336 -2.83441869 0.17049286
C  -1.38389204 3.44770212 0.03557936
C  -3.75337116 -0.73621517 -0.33332473
C  2.26091402 2.79606723 0.36003063
C  2.28513693 1.38265777 0.313892
C  -2.50247909 -2.87053206 -0.28750651
C  -2.54376953 -1.45954685 -0.2430646
C  1.08196248 3.46180083 0.27077817
C  -0.14501431 2.77556085 0.13040782
C  -1.32668762 -3.53972106 -0.19857962
C  -0.10144504 -2.85231719 -0.05843395
C  3.51120193 -0.68303857 0.3596293
C  2.31559572 -1.42277908 0.22055162
C  -3.76394002 0.61881048 -0.28785171
C  3.50517408 0.67305059 0.40555413
C  1.13741746 -3.52308569 0.03645475
H  3.21209471 3.3087783 0.46785945
H  -3.43098939 -3.41284391 -0.39443142
H  4.41529314 1.25578928 0.51200996
H  1.14605411 -4.60310674 0.00025762
H  -1.38696689 4.52755563 0.07233984
H  -4.67823753 -1.28474425 -0.44011703
H  1.06933086 4.54171129 0.30665092
H  -1.31235339 -4.61974195 -0.23424479
H  4.44635301 -1.2198767 0.43010759
H  -4.69824743 1.15735894 -0.35825626
H  -3.48642184 3.30088892 -0.16949264
H  3.23765385 -3.36304436 0.24177046
Cl 5.69411019 3.38904544 0.70512746
