program: Gaussian 16
title: Cl3-c54h18 opt
version: ES64L-G16RevC.02
basis: CBSB1
frameworkgroup: C1[X(C54H18Cl)]
method: RHF
basis: STO-3G
operation: FOpt
keyword: #P
keyword: opt
keyword: EmpiricalDispersion=GD3BJ
keyword: integral(grid=ultrafinegrid)
keyword: GFInputpop=full
keyword: IOP(3/74=-78)
keyword: IOP(6/7=3)
keyword: IOP(3/5=10)
keyword: IOP(3/175=01217700)
keyword: IOP(3/177=414500)
keyword: IOP(3/178=4859300)
title: #P opt EmpiricalDispersion=GD3BJ integral(grid=ultrafinegrid) GFInput
nucrepener: 7060.2639716807
basis: NPDir=0 NMtPBC= 1 NCelOv= 1 NCel= 1 NClECP= 1 NCelD= 1
basis: NCelK= 1 NCelE2= 1 NClLst= 1 CellRange= 0.0.
basis: One-electron integrals computed using PRISM.
basis: One-electron integral symmetry used in STVInt
basis: NBasis= 1998 RedAO= T EigKep= 1.02D-06 NBF= 1998
basis: NBsUse= 1930 1.00D-06 EigRej= 8.96D-07 NBFU= 1930
converged: YES YES YES YES
title: Mulliken charges:
elementType: C C C C C C C C C C C C C C C C C C C C C C C C C C C C C C C C C C C C C C C C C C C C C C C C C C C C C C H H H H H H H H H H H H H H H H H H Cl
charge: -0.156316 -0.172592 0.067488 0.000765 -0.002175 0.061005 0.137829 -0.222573 0.101508 0.436067 -0.311797 0.418328 0.273066 0.033830 0.421244 0.095557 -0.459400 -0.422476 -0.403253 -0.411830 -0.360017 -0.327787 0.775253 -0.267765 0.112510 -0.225924 0.672555 -0.259821 0.112817 -0.224596 0.005330 0.223969 -0.388509 0.428395 -0.053261 0.187425 -0.390442 0.428191 0.440660 -0.307938 0.419307 0.136609 -0.219191 0.099285 -0.474768 -0.424226 -0.405703 -0.413516 0.212464 0.040872 0.420810 0.094876 -0.345127 -0.326658 0.123223 0.087135 0.080311 0.085103 0.063806 0.021522 0.083522 0.085020 0.047378 0.021520 0.113933 0.087080 0.021228 0.082406 0.086799 0.021423 0.082494 0.086709 -1.160966
chargesum: -1.00000
charge: -0.007829 -0.028338 0.073945 -0.039460 0.015035 0.045993 0.127736 -0.198640 0.112422 0.442436 -0.388145 0.380548 0.329050 0.106209 0.383579 0.094327 -0.429055 -0.313041 -0.357551 -0.339573 -0.368962 -0.366653 0.158945 -0.099634 0.121621 -0.219372 0.181726 -0.192562 0.103085 -0.194444 -0.409032 0.303532 -0.438685 0.482600 -0.471304 0.611187 -0.366574 0.440901 0.310729 -0.372234 0.299180 0.149750 -0.233570 0.120003 -0.252270 -0.418666 -0.267556 -0.376546 0.202506 0.187097 0.347901 0.122722 -0.029877 -0.326910 0.049363 0.088336 0.154164 0.090524 -0.080907 0.024838 0.095530 0.087963 0.023930 0.026689 0.126821 0.093511 0.027976 0.089684 0.092435 0.026289 0.088596 0.095218 -0.949239
dipole: -28.6230 -0.1607 -0.0027
dipole: 28.6235
quadrupole: -575.5956 -297.1429 -332.3670
quadrupole: -0.6077 -0.0245 -0.0003
quadrupole: -173.8938 104.5589 69.3348 -0.6077 -0.0245 -0.0003
hfenergy: -2526.1408041 hartree
pointgroup: C01 [X(C54H18Cl1)]
dipole: -8.8245902 -6.9900197 -0.2901265 debye
InChI: InChI=1/54C.Cl.18H
charge -1 multiplicity 1
73 atoms
C  -0.07498217 1.38512197 0.04177357
C  1.14639129 0.6937066 0.06067224
C  1.15772286 -0.70929158 0.0429607
C  -0.05086089 -1.42043018 0.00658864
C  -1.27157766 -0.72939217 -0.01218383
C  -1.28307887 0.67371062 0.00529686
C  -2.52531026 2.77661107 0.00395587
C  -2.51595876 1.37233354 -0.01361886
C  2.40277923 -2.80916426 0.0444339
C  -3.75671717 3.46851566 -0.0151263
C  -4.939956 2.74774357 -0.05110207
C  3.63488725 -3.49738494 0.06355905
C  -1.3076455 4.9042456 0.05863872
C  -1.3063878 3.49254016 0.04072324
C  1.1914779 -4.93976929 -0.01008604
C  1.18454001 -3.52758227 0.00773682
C  -2.56805631 5.57505766 0.03860052
C  -3.72890802 4.89614261 0.00365564
C  2.45220368 -5.60918893 0.00992197
C  3.60975168 -4.92446893 0.04482835
C  -0.10226023 5.58724984 0.09465893
C  -4.89458433 -2.86181357 -0.12143936
C  2.35386483 2.81519401 0.11500498
C  2.36495854 1.41198855 0.09728762
C  -2.47951247 -2.85180073 -0.06659435
C  -2.49206844 -1.44770618 -0.04908139
C  1.12479497 3.51196785 0.09604199
C  -0.08530992 2.80228176 0.05959166
C  -1.24814457 -3.54885536 -0.04761739
C  -0.03847063 -2.8373816 -0.01115093
C  3.54186171 4.95141393 0.16914989
C  3.5727177 3.522109 0.15153833
C  -3.64874121 -4.98952457 -0.12029528
C  -3.69906807 -3.56267725 -0.10328017
C  2.3680812 5.61220421 0.15102243
C  1.11749564 4.92468894 0.11388071
C  -2.47819377 -5.65174191 -0.10221789
C  -1.22960387 -4.96063277 -0.06515372
C  4.82848263 -1.3883207 0.11739949
C  4.81763867 -2.77489127 0.09951185
C  -4.95014952 1.36152032 -0.06896525
C  3.59959046 -0.6908119 0.09845447
C  2.39156451 -1.40585249 0.06208303
C  -3.72509336 0.66013361 -0.05016511
C  6.02416779 0.71475015 0.17118846
C  6.03895622 -0.63077641 0.15442159
C  -6.15002228 -0.73949658 -0.1228758
C  -6.16018826 0.60558486 -0.10599721
C  4.79853772 1.44684724 0.15276889
C  3.58674144 0.72318401 0.11620049
C  -4.92711362 -1.47591117 -0.10454196
C  -3.7136235 -0.75495098 -0.06784784
C  4.77758463 2.83329317 0.16995298
C  -0.01334158 -5.6246846 -0.04607371
H  4.49920559 5.46340865 0.19744896
H  -4.58163206 -5.53359963 -0.14834554
H  6.9438084 1.27992655 0.19919128
H  -7.07864066 -1.29078878 -0.15093246
H  5.69515134 3.41714 0.19817399
H  -0.00373265 -6.70576092 -0.05961253
H  -2.57077963 6.65529282 0.05226831
H  2.45833252 -6.6893783 -0.00368498
H  -0.11048914 6.66819289 0.10823082
H  -5.82602742 -3.40999038 -0.14952913
H  2.35678371 6.69236062 0.1645473
H  -2.46407892 -6.7319311 -0.11564205
H  5.75851771 -3.30723673 0.11403381
H  6.97690414 -1.16629992 0.16886453
H  -7.09765427 1.14241176 -0.12040437
H  -5.8804967 3.28087496 -0.06561544
H  -4.6699872 5.42643341 -0.01093577
H  4.55262248 -5.45167689 0.05945725
Cl 6.96700592 5.49074105 0.25439658
