program: Gaussian 09
title: 000004477
version: EM64L-G09RevD.01
frameworkgroup: C1[X(C13H8Cl2N2O4)]
method: RPBEPBE
basis: SDD
operation: Freq
keyword: #p
keyword: freq=noraman
keyword: PBEPBE/SDD
title: #p freq=noraman PBEPBE/SDD
converged: YES YES NO NO
title: Mulliken charges:
elementType: Cl Cl O O O O N N C C C C C C C C C C C C C H H H H H H H H
charge: -0.033435 -0.043605 -0.391565 -0.367087 -0.200727 -0.204772 -0.455527 0.021259 0.653143 0.154423 0.245765 -0.381520 -0.274763 0.137114 0.418635 -0.227978 -0.386376 -0.381955 -0.325419 -0.180621 -0.198416 0.325716 0.331495 0.224456 0.314152 0.293297 0.269156 0.265325 0.399829
chargesum: 0.00000
title: Mulliken charges with hydrogens summed into heavy atoms:
elementType: Cl Cl O O O O N N C C C C C C C C C C C C C
charge: -0.033435 -0.043605 0.008264 -0.367087 -0.200727 -0.204772 -0.129811 0.021259 0.653143 0.154423 0.245765 -0.381520 0.056732 0.137114 0.418635 -0.003522 -0.072224 -0.088657 -0.056263 -0.180621 0.066909
polarizability: 3.86194342e+02 -4.01901950e+00 2.24861781e+02 4.77806627e-02 -2.35052575e-02 6.83749829e+01
1716.lowfreq: -6.0958 -2.8166 0.0008 0.0012 0.0023 3.6668 14.2405 31.3713 51.7271
frequency: 14.2238 31.3637 51.7234 58.0389 77.7090 118.7500 129.4934 146.3736 159.5110 168.1188 172.1043 201.6551 254.3047 315.2828 325.2883 333.2157 351.5180 371.6031 396.4055 430.7852 439.1430 449.0156 452.7944 498.8077 512.1183 532.4838 533.4732 627.1642 633.4884 669.0149 680.0204 689.0829 694.9231 705.2276 740.5684 764.1635 769.6371 820.0571 827.6389 845.8516 858.5095 872.2948 887.2004 912.2684 918.5569 961.9044 1011.3613 1020.7960 1067.1619 1085.6646 1098.6737 1134.8994 1141.4008 1204.8673 1224.5230 1242.3297 1260.7501 1277.8194 1305.1660 1334.7200 1363.2487 1392.7355 1398.0869 1404.1804 1422.7803 1452.7629 1473.4364 1529.0410 1560.2702 1574.5620 1587.6991 1609.8995 1638.4942 2876.7176 3139.2557 3167.3136 3184.8295 3187.5559 3189.7265 3204.6392 3487.4437
redmass: 14.9436 7.1024 13.9734 13.2842 6.8470 7.5300 14.2592 7.5605 5.9314 17.3394 5.4743 9.5017 9.7729 7.1002 10.2829 5.4826 15.9655 9.2724 8.8310 3.4202 10.8653 3.6003 8.4724 5.0639 3.2702 5.9958 4.1866 7.9103 8.0460 3.1860 2.5435 9.3771 3.0576 8.1508 3.9683 3.2342 7.6818 7.6894 1.5363 1.6014 6.5860 1.3811 7.4762 1.0815 1.4162 1.3395 1.3255 3.2522 3.2751 2.3970 2.9838 1.4688 1.3502 5.9450 1.6069 1.8264 3.3392 2.0901 1.9317 2.0289 7.1148 8.0440 4.9138 5.5954 5.3879 2.3868 2.8893 2.8244 4.7807 3.9792 4.5574 6.0390 4.4585 1.0688 1.0918 1.0890 1.0907 1.0977 1.0932 1.0959 1.0753
irintensity: 0.0979 0.4312 0.3366 0.3021 5.3768 0.2737 2.7298 0.0041 0.4406 3.6647 0.0386 0.1085 0.3983 3.6882 4.6656 1.0511 3.0428 8.7346 7.1899 0.0112 12.2080 10.7609 2.9937 12.8444 13.5274 1.9978 4.0173 12.6169 20.6988 13.4517 31.0812 9.4470 0.0443 71.0462 8.1961 18.3688 27.1894 9.4958 76.0692 14.3721 10.1724 23.6356 14.2286 118.2236 67.7555 0.0195 1.6700 8.8762 12.3397 18.1886 53.6284 9.4846 16.7984 860.5142 94.2535 102.3573 117.4336 66.0540 165.3466 229.1243 138.7079 138.5536 190.4915 49.7837 35.8255 96.6344 116.9785 843.6979 33.7091 19.9070 23.2855 248.8922 78.7911 413.0436 3.8949 0.3406 4.0767 2.4624 12.2770 8.3132 44.2969
temp: 298.150 k
press: 1.00000 atm
elementType: 17 17 8 8 8 8 7 7 6 6 6 6 6 6 6 6 6 6 6 6 6 1 1 1 1 1 1 1 1
symmnumber: 1
zpe: 500384.1 jmol-1
zpe.correction: 0.190586 hartree
zpe.thermalcorrener: 0.208689 hartree
zpe.thermalcorrenthalpy: 0.209633 hartree
zpe.thermalcorrgfe: 0.141621 hartree
zpe.sumelectzpe: -1829.174631 hartree
zpe.sumelectthermal: -1829.156528 hartree
zpe.sumelectthermalent: -1829.155584 hartree
zpe.sumelectthermalfe: -1829.223596 hartree
dipole: -4.4761 0.7241 0.0015
dipole: 4.5343
quadrupole: -166.5352 -141.1608 -136.0738
quadrupole: 0.8884 -0.0378 -0.0310
quadrupole: -18.6119 6.7625 11.8494 0.8884 -0.0378 -0.0310
hfenergy: -1829.365217 hartree
pointgroup: C01 [X(C13H8Cl2N2O4)]
dipole: 1.7411913 0.387705 0.0189845 debye
polarizability: 385.10823|13.4698716|225.8630662|4.3418751|-1.8084907|68.459809 unknown
InChI: InChI=1S/C13H8Cl2N2O4/c14-7-1-4-12(18)9(5-7)13(19)16-11-3-2-8(17(20)21)6-10(11)15/h1-6,16,18H
charge 0 multiplicity 1
29 atoms
Cl -1.165139 2.875389 -0.031881
Cl 4.90296 3.073122 0.041986
O  3.309558 -2.721061 0.099113
O  0.878343 -2.030621 0.058947
O  -6.041657 -1.292561 -0.056882
O  -6.139096 0.98933 -0.085248
N  0.212597 0.210248 0.020259
N  -5.487219 -0.126345 -0.061888
C  -1.186947 0.061383 0.001176
C  2.610857 -0.35204 0.059583
C  1.191666 -0.777495 0.046268
C  -1.991916 1.241579 -0.024855
C  -1.856691 -1.196744 0.005635
C  3.618658 -1.383598 0.08601
C  -4.009664 -0.064436 -0.040186
C  3.028848 1.012438 0.046452
C  -3.386733 1.20344 -0.045511
C  -3.259336 -1.258881 -0.015046
C  4.994419 -1.028332 0.099693
C  4.389837 1.326098 0.060132
C  5.384805 0.317372 0.086964
H  0.529787 1.184492 0.01295
H  -1.25075 -2.10293 0.025488
H  2.312498 1.840531 0.025348
H  -3.994103 2.111176 -0.065444
H  -3.780902 -2.219061 -0.011964
H  5.733056 -1.83371 0.120325
H  6.443887 0.58988 0.097599
H  2.282578 -2.800165 0.084277
