program: Gaussian 16
title: Cl1-c54h18 opt
version: ES64L-G16RevA.03
basis: CBSB1
frameworkgroup: C2V[C2(Cl),SGV(C6H2),X(C48H16)]
method: RHF
basis: STO-3G
operation: Freq
keyword: #P
keyword: freq=noraman
keyword: EmpiricalDispersion=GD3BJ
keyword: integral(grid=ultrafinegrid)
keyword: GFInput
keyword: pop=full
keyword: IOP(3/74=-78)
keyword: IOP(6/7=3)
keyword: IOP(3/5=10)
keyword: IOP(3/175=01217700)
keyword: IOP(3/177=414500)
keyword: IOP(3/178=4859300)
keyword: SCF=YQC
title: #P freq=noraman EmpiricalDispersion=GD3BJ integral(grid=ultrafinegrid)
nucrepener: 7083.2104734064
basis: NPDir=0 NMtPBC= 1 NCelOv= 1 NCel= 1 NClECP= 1 NCelD= 1
basis: NCelK= 1 NCelE2= 1 NClLst= 1 CellRange= 0.0.
basis: One-electron integrals computed using PRISM.
basis: One-electron integral symmetry used in STVInt
basis: NBasis= 1998 RedAO= T EigKep= 1.11D-06 NBF= 529 471 479 519
basis: NBsUse= 1930 1.00D-06 EigRej= 8.91D-07 NBFU= 514 453 464 499
converged: YES YES YES YES
title: Mulliken charges:
elementType: C C C C C C C C C C C C C C C C C C C C C C C C C C C C C C C C C C C C C C C C C C C C C C C C C C C C C C H H H H H H H H H H H H H H H H H H Cl
charge: 0.140504 0.140884 0.140504 0.140504 0.140884 0.140504 0.098933 -0.272792 0.098933 0.440748 -0.319786 0.440748 0.440748 0.098933 0.440748 0.098933 -0.405694 -0.405694 -0.405694 -0.405694 -0.319786 -0.319761 0.098844 -0.272704 0.098844 -0.272704 0.098902 -0.272792 0.098902 -0.272792 -0.405698 0.440764 -0.405698 0.440764 -0.405737 0.440767 -0.405737 0.440767 0.440767 -0.319786 0.440767 0.098902 -0.272792 0.098902 -0.405698 -0.405737 -0.405698 -0.405737 0.440764 0.098844 0.440764 0.098844 -0.319761 -0.319786 0.085252 0.085252 0.085252 0.085252 0.021147 0.021147 0.085253 0.085253 0.021147 0.021147 0.085253 0.085253 0.021147 0.085253 0.085253 0.021147 0.085253 0.085253 -1.045784
chargesum: -1.00000
title: Mulliken charges with hydrogens summed into heavy atoms:
elementType: C C C C C C C C C C C C C C C C C C C C C C C C C C C C C C C C C C C C C C C C C C C C C C C C C C C C C C Cl
charge: 0.140504 0.140884 0.140504 0.140504 0.140884 0.140504 0.098933 -0.272792 0.098933 0.440748 -0.298638 0.440748 0.440748 0.098933 0.440748 0.098933 -0.320440 -0.320440 -0.320440 -0.320440 -0.298638 -0.298614 0.098844 -0.272704 0.098844 -0.272704 0.098902 -0.272792 0.098902 -0.272792 -0.320446 0.440764 -0.320446 0.440764 -0.320484 0.440767 -0.320484 0.440767 0.440767 -0.298638 0.440767 0.098902 -0.272792 0.098902 -0.320446 -0.320484 -0.320446 -0.320484 0.440764 0.098844 0.440764 0.098844 -0.298614 -0.298638 -1.045784
polarizability: 1.02191934e+03 4.72583269e-06 1.02191839e+03 3.76513098e-06 -5.01872628e-07 2.73845586e+02
1716.lowfreq: -8.8378 -5.6653 -3.2122 -3.1690 -0.0006 0.0014 0.0016 4.1012 40.5901
frequency: -8.8228 -5.6610 40.5901 40.6215 47.9602 78.9027 104.8561 105.7258 132.5450 132.5745 150.2837 150.2928 225.1015 225.1193 236.5001 236.5779 239.6005 262.5896 262.5988 279.1520 279.2194 294.6380 305.1963 319.7924 348.4754 356.4740 359.9998 360.0020 383.4980 389.5574 389.5824 396.8433 396.8598 400.5371 400.5734 409.1805 470.5228 470.5387 490.1234 490.1458 498.0580 507.4983 511.9930 520.4214 520.4338 550.7014 551.7012 552.5549 552.6255 568.8012 568.8219 572.3808 595.5392 598.7711 598.8129 609.4337 616.7745 616.7967 618.1102 629.9803 630.0474 640.4614 640.5757 648.6412 648.6525 656.4677 660.5969 660.6798 679.9678 679.9749 680.4406 680.4518 714.7759 714.7875 734.8832 747.8655 773.1219 773.1397 780.1765 780.3543 784.1000 784.1203 790.5335 799.8070 799.8191 818.6038 828.5443 828.5730 834.7571 847.4849 847.4885 858.8435 861.1090 877.0048 877.3240 877.3285 879.6983 879.7290 903.7943 916.1633 923.6946 923.7024 934.8569 934.8602 937.3529 938.9996 1014.7663 1015.8294 1015.8367 1017.4927 1017.4991 1017.8338 1041.6778 1041.7105 1053.9861 1054.0156 1060.3118 1086.3321 1086.3479 1148.3388 1150.1307 1156.1933 1175.8886 1175.9020 1184.1535 1211.3520 1211.3786 1214.5144 1214.5331 1221.3346 1221.3685 1239.1267 1239.1654 1255.1162 1272.0464 1294.3303 1316.6106 1338.3938 1339.3963 1339.4053 1349.2576 1349.2626 1349.4853 1376.9180 1376.9700 1377.9708 1377.9958 1399.5922 1428.6870 1428.7026 1428.7733 1452.1283 1452.1834 1472.0414 1474.6123 1474.6646 1483.6645 1483.7014 1498.9477 1498.9518 1499.3706 1500.4320 1505.8108 1505.8292 1506.5958 1506.6306 1509.8269 1524.3824 1553.5354 1561.6703 1561.6760 1575.6108 1576.4918 1576.5276 1579.6094 1591.8115 1603.7213 1603.7485 1623.0287 1623.0389 1629.8490 1678.6389 1681.0035 1681.0520 1697.5790 1697.6188 1713.2326 1720.5013 1720.5059 1730.9469 1742.9360 1743.0437 1748.8288 1748.8416 1751.9784 3232.6269 3232.8773 3232.9058 3233.6089 3233.6230 3234.7331 3234.8531 3236.0350 3236.0351 3236.9395 3236.9492 3237.1867 3255.2252 3255.4178 3255.4323 3255.8330 3255.8457 3256.3424
redmass: 26.8210 26.8055 6.3761 6.3762 7.4305 5.5421 6.0092 17.1249 6.1287 6.1269 5.1954 5.1950 4.9600 4.9601 6.2750 6.2742 5.3008 9.2367 9.2368 6.8384 6.8383 5.6803 4.8937 5.3612 8.4052 8.5840 5.5855 5.5856 7.2387 5.6455 5.6449 5.1923 5.1945 6.1063 6.1049 6.7980 4.0021 4.0021 7.1372 7.1372 3.4927 5.4119 6.7590 5.7869 5.7859 6.3425 6.1458 5.7972 5.7966 5.2252 5.2244 4.7591 5.9255 8.9818 8.9817 3.7797 5.6518 5.6489 5.2232 4.6808 4.6814 4.9585 4.9428 6.8391 6.8387 7.3599 6.7236 6.7589 8.1961 8.2019 6.8238 6.8262 4.6195 4.6203 4.2030 7.7880 5.2957 5.2975 8.4713 5.7437 7.1026 7.1024 8.6409 7.4115 7.4118 1.3320 1.4039 1.4039 11.4374 1.5273 1.5272 1.6099 6.7505 9.6319 6.6496 6.6510 6.5526 6.5522 5.0224 1.4669 1.5156 1.5155 1.5816 1.5815 5.8807 1.6022 1.3006 1.3076 1.3076 1.3177 1.3177 1.3178 6.2453 6.2450 7.6759 7.6749 9.2732 3.8193 3.8187 3.0835 2.3997 1.8842 1.9366 1.9376 1.5765 1.2007 1.2007 2.1011 2.1002 1.6899 1.6886 1.3491 1.3490 1.3391 2.7105 2.2276 1.9963 2.7394 2.4110 2.4105 3.2337 3.2332 9.2090 2.8373 2.8379 8.3475 8.3474 3.5852 7.2785 6.8238 9.5096 4.3612 4.3634 1.6690 7.2263 7.2049 7.1209 7.0954 4.6942 4.6928 9.2122 10.4659 9.2022 9.1868 2.9803 2.9789 5.7762 10.1847 6.5601 4.2781 4.2807 10.1517 9.7986 9.8010 5.5955 6.2650 7.9889 7.9899 8.6586 8.6570 7.9881 5.9754 8.7488 8.7502 7.0440 7.0438 11.8178 7.1361 7.1351 7.6887 10.0699 10.0711 8.1425 8.1406 7.4271 1.0882 1.0882 1.0882 1.0882 1.0882 1.0859 1.0905 1.0882 1.0883 1.0883 1.0883 1.0882 1.0968 1.0968 1.0967 1.0967 1.0967 1.0966
irintensity: 6.8830 6.8824 0.0000 0.0000 11.2915 0.0000 0.0000 17.6253 0.0029 0.0026 0.0000 0.0000 0.0070 0.0069 0.0000 0.0011 15.5121 0.0000 0.0000 7.5815 7.5824 0.0000 0.8512 0.0000 0.0001 0.0000 0.0000 0.0000 0.0000 0.0000 0.0000 0.0275 0.0271 0.0000 0.0000 0.0000 0.0000 0.0000 0.0000 0.0000 0.0000 0.0000 0.0000 3.2389 3.2383 0.0000 0.0000 0.0349 0.0355 0.0000 0.0012 26.3177 0.0000 0.4113 0.4109 0.0000 0.0000 0.0000 0.0000 0.0012 0.0010 0.0000 0.0000 0.1054 0.1074 0.0000 0.0000 0.0000 0.0000 0.0000 6.3377 6.3331 0.1252 0.1236 55.4314 0.0000 0.0000 0.0000 0.0000 0.0000 0.0284 0.0283 0.0000 0.0000 0.0000 31.4752 0.0001 0.0001 0.0000 0.0000 0.0000 0.0000 0.0000 0.0999 0.0000 0.0001 4.8782 4.8752 0.0000 0.0000 0.0000 0.0000 0.2045 0.2048 0.0000 193.4485 0.0000 0.0713 0.0712 0.0000 0.0000 0.0000 0.0000 0.0000 0.0398 0.0399 0.0000 12.4512 12.4486 0.0000 0.0000 0.0000 0.0000 0.0000 0.0007 22.6238 22.6194 0.0000 0.0000 0.0000 0.0000 0.2688 0.2709 0.0000 0.0003 0.0000 0.0000 0.0000 0.0000 0.0000 11.4917 11.4890 0.1305 0.0000 0.0000 22.4818 22.5015 0.0000 0.0472 0.0000 0.2138 4.0219 4.0405 0.0000 4.0468 4.0933 30.6791 30.7018 0.0000 0.0000 0.0002 0.0000 0.0000 0.0000 11.1795 11.1442 0.0000 0.1316 0.0000 0.0000 0.0000 0.0139 0.3432 0.3402 0.0000 0.0000 0.0000 0.0000 2.7807 2.7953 0.0000 0.0000 0.0000 0.0000 0.0000 0.0000 0.0001 5.2304 5.2222 0.0000 0.0000 0.0000 1.8634 1.8645 0.0901 0.0075 0.0000 0.0000 15.9110 15.5157 0.0000 0.0001 44.6769 45.1161 0.0000 0.0000 0.0023 0.0506 0.0000 0.0000 189.3615 189.3448 0.0018
temp: 298.150 k
press: 1.00000 atm
elementType: 6 6 6 6 6 6 6 6 6 6 6 6 6 6 6 6 6 6 6 6 6 6 6 6 6 6 6 6 6 6 6 6 6 6 6 6 6 6 6 6 6 6 6 6 6 6 6 6 6 6 6 6 6 6 1 1 1 1 1 1 1 1 1 1 1 1 1 1 1 1 1 1 17
symmnumber: 2
zpe: 1444748.7 jmol-1
zpe.correction: 0.550276 hartree
zpe.thermalcorrener: 0.579540 hartree
zpe.thermalcorrenthalpy: 0.580484 hartree
zpe.thermalcorrgfe: 0.495655 hartree
zpe.sumelectzpe: -2525.570665 hartree
zpe.sumelectthermal: -2525.541401 hartree
zpe.sumelectthermalent: -2525.540456 hartree
zpe.sumelectthermalfe: -2525.625285 hartree
dipole: 0.0000 0.0000 -10.1584
dipole: 10.1584
quadrupole: -306.3419 -306.3416 -372.6320
quadrupole: -0.0000 0.0000 -0.0000
quadrupole: 22.0966 22.0969 -44.1935 -0.0000 0.0000 -0.0000
hfenergy: -2526.1209408 hartree
pointgroup: C02V [C2(Cl1),SGV(C6H2),X(C48H16)]
dipole: 0. 0. -3.9966138 debye
polarizability: 1021.9191089|-0.0004126|1021.9186216|0.000003|-0.0000023|273.8455861 unknown
InChI: InChI=1/54C.Cl.18H
charge -1 multiplicity 1
73 atoms
C  -0.700164 1.212719 -0.190151
C  0.70016376 1.21271914 -0.190151
C  1.40032746 -0.00000037 -0.190151
C  0.700164 -1.212719 -0.190151
C  -0.70016376 -1.21271914 -0.190151
C  -1.40032746 0.00000037 -0.190151
C  -3.517803 1.21474 -0.157534
C  -2.81488 0.0000 -0.171208
C  3.517803 -1.21474 -0.157534
C  -4.929361 1.209522 -0.138929
C  -5.605467 0.0000 -0.131801
C  4.929361 -1.209522 -0.138929
C  -3.51215712 3.66419101 -0.138929
C  -2.81089709 2.43913689 -0.157534
C  3.51215712 -3.66419101 -0.138929
C  2.81089709 -2.43913689 -0.157534
C  -4.93905 3.627965 -0.123277
C  -5.61143474 2.46336052 -0.123277
C  4.93905 -3.627965 -0.123277
C  5.61143474 -2.46336052 -0.123277
C  -2.80273328 4.85447695 -0.131801
C  -2.80273381 -4.85447711 -0.131801
C  0.706906 3.653877 -0.157534
C  1.40744023 2.43775787 -0.171208
C  -0.706906 -3.653877 -0.157534
C  -1.40744023 -2.43775787 -0.171208
C  -0.706906 3.653877 -0.157534
C  -1.40743989 2.43775765 -0.171208
C  0.706906 -3.653877 -0.157534
C  1.40743989 -2.43775765 -0.171208
C  0.672385 6.091326 -0.123277
C  1.417203 4.873712 -0.138929
C  -0.672385 -6.091326 -0.123277
C  -1.417203 -4.873712 -0.138929
C  -0.672385 6.091326 -0.123277
C  -1.417203 4.873712 -0.138929
C  0.672385 -6.091326 -0.123277
C  1.417203 -4.873712 -0.138929
C  4.92935996 1.20952198 -0.138929
C  5.605467 0.0000 -0.131801
C  -4.92935996 -1.20952198 -0.138929
C  3.51780336 1.21473979 -0.157534
C  2.81488 0.0000 -0.171208
C  -3.51780336 -1.21473979 -0.157534
C  4.93905072 3.62796527 -0.123277
C  5.61143567 2.46336026 -0.123277
C  -4.93905072 -3.62796527 -0.123277
C  -5.61143567 -2.46336026 -0.123277
C  3.51215707 3.66418964 -0.138929
C  2.81089741 2.43913693 -0.157534
C  -3.51215707 -3.66418964 -0.138929
C  -2.81089741 -2.43913693 -0.157534
C  2.80273381 4.85447711 -0.131801
C  2.80273328 -4.85447695 -0.131801
H  1.21761 7.024037 -0.106403
H  -1.21761 -7.024037 -0.106403
H  5.47418968 4.56649945 -0.106403
H  -5.47418968 -4.56649945 -0.106403
H  3.3433194 5.79079877 -0.113717
H  3.343319 -5.790799 -0.113717
H  -5.47419 4.5665 -0.106403
H  5.47419 -4.5665 -0.106403
H  -3.343319 5.790799 -0.113717
H  -3.3433194 -5.79079877 -0.113717
H  -1.21761 7.024037 -0.106403
H  1.21761 -7.024037 -0.106403
H  6.68663854 0.00000002 -0.113717
H  6.69179959 2.45753701 -0.106403
H  -6.69179959 -2.45753701 -0.106403
H  -6.68663854 -0.00000002 -0.113717
H  -6.6917999 2.4575379 -0.106403
H  6.6917999 -2.4575379 -0.106403
Cl 0.0000 0.0000 2.937306
