program: Gaussian 16
title: Cl3-c54h18 opt
version: ES64L-G16RevA.03
basis: CBSB1
frameworkgroup: C1[X(C54H18Cl)]
method: RHF
basis: STO-3G
operation: Freq
keyword: #P
keyword: freq=noraman
keyword: EmpiricalDispersion=GD3BJ
keyword: integral(grid=ultrafinegrid)
keyword: GFInput
keyword: pop=full
keyword: IOP(3/74=-78)
keyword: IOP(6/7=3)
keyword: IOP(3/5=10)
keyword: IOP(3/175=01217700)
keyword: IOP(3/177=414500)
keyword: IOP(3/178=4859300)
keyword: SCF=YQC
title: #P freq=noraman EmpiricalDispersion=GD3BJ integral(grid=ultrafinegrid)
nucrepener: 6873.6918213881
basis: NPDir=0 NMtPBC= 1 NCelOv= 1 NCel= 1 NClECP= 1 NCelD= 1
basis: NCelK= 1 NCelE2= 1 NClLst= 1 CellRange= 0.0.
basis: One-electron integrals computed using PRISM.
basis: One-electron integral symmetry used in STVInt
basis: NBasis= 1998 RedAO= T EigKep= 1.06D-06 NBF= 1998
basis: NBsUse= 1929 1.00D-06 EigRej= 9.22D-07 NBFU= 1929
converged: NO YES NO NO
title: Mulliken charges:
elementType: C C C C C C C C C C C C C C C C C C C C C C C C C C C C C C C C C C C C C C C C C C C C C C C C C C C C C C H H H H H H H H H H H H H H H H H H Cl
charge: -0.007831 -0.028338 0.073946 -0.039460 0.015036 0.045992 0.127736 -0.198639 0.112421 0.442438 -0.388146 0.380549 0.329051 0.106210 0.383578 0.094327 -0.429055 -0.313040 -0.357551 -0.339571 -0.368961 -0.366653 0.158945 -0.099633 0.121620 -0.219372 0.181726 -0.192562 0.103084 -0.194443 -0.409033 0.303533 -0.438684 0.482602 -0.471304 0.611185 -0.366575 0.440902 0.310729 -0.372232 0.299179 0.149749 -0.233571 0.120003 -0.252270 -0.418664 -0.267556 -0.376546 0.202504 0.187096 0.347900 0.122722 -0.029878 -0.326911 0.049363 0.088336 0.154164 0.090524 -0.080906 0.024837 0.095530 0.087963 0.023930 0.026689 0.126822 0.093511 0.027976 0.089683 0.092435 0.026289 0.088596 0.095218 -0.949239
chargesum: -1.00000
title: Mulliken charges with hydrogens summed into heavy atoms:
elementType: C C C C C C C C C C C C C C C C C C C C C C C C C C C C C C C C C C C C C C C C C C C C C C C C C C C C C C Cl
charge: -0.007831 -0.028338 0.073946 -0.039460 0.015036 0.045992 0.127736 -0.198639 0.112421 0.442438 -0.361857 0.380549 0.329051 0.106210 0.383578 0.094327 -0.333525 -0.224444 -0.269588 -0.244354 -0.345031 -0.339964 0.158945 -0.099633 0.121620 -0.219372 0.181726 -0.192562 0.103084 -0.194443 -0.359671 0.303533 -0.350349 0.482602 -0.344483 0.611185 -0.273064 0.440902 0.310729 -0.344257 0.299179 0.149749 -0.233571 0.120003 -0.098106 -0.328980 -0.177032 -0.284110 0.202504 0.187096 0.347900 0.122722 -0.110785 -0.302073 -0.949239
polarizability: 1.07851925e+03 1.17715064e+00 1.02423325e+03 2.29179236e-03 -9.92037397e-04 2.58151513e+02
1716.lowfreq: -2.9471 -0.9786 0.0006 0.0012 0.0013 4.5481 25.0008 42.1856 42.4937
frequency: 24.9961 42.1856 42.4934 45.3514 58.3220 80.4895 107.8336 107.9089 132.8594 134.7790 151.2819 152.9891 225.6226 226.7255 239.1381 240.7477 242.2064 263.0230 264.4648 279.0728 280.1209 298.3742 305.1118 320.9172 326.8276 348.2173 356.6483 358.0163 360.9035 380.6556 389.4177 390.1732 392.2690 397.7503 398.4544 406.9574 409.0643 410.9870 470.3866 471.3964 489.3307 489.6129 490.2032 506.7243 512.1212 520.0402 521.6612 536.6235 546.4604 549.6693 550.8880 552.2298 567.2768 568.5057 568.7314 572.4683 574.0246 588.6500 597.9438 598.5203 613.3005 616.2711 617.0222 647.1172 648.9512 651.6912 652.5078 654.9285 679.0549 679.3661 680.7270 681.0088 704.2495 704.9312 734.6378 743.6300 746.8365 773.8426 774.4152 776.5701 777.5560 782.4726 790.0392 799.1322 799.4454 822.7686 825.6836 834.7636 844.0167 856.3876 860.3556 863.9112 874.9935 876.6101 877.5153 878.7958 879.0926 884.1959 903.4194 926.5675 935.0811 937.8861 940.6989 946.2261 952.2325 1020.7127 1021.9316 1023.2054 1024.2102 1037.0429 1041.1659 1041.9074 1051.4865 1051.9803 1059.3518 1067.0703 1086.1194 1087.5987 1109.5841 1149.7597 1156.1502 1159.1275 1175.0511 1178.4067 1185.8331 1212.6470 1213.7812 1215.5238 1219.0250 1223.9724 1228.4237 1240.4294 1248.1739 1267.6365 1272.0468 1297.7395 1321.9217 1336.9544 1340.1953 1342.0945 1347.6992 1349.2283 1352.3441 1374.8256 1375.1440 1377.6605 1379.8444 1399.2748 1423.1614 1424.4225 1428.8090 1450.5595 1452.7129 1472.6375 1473.6839 1475.7255 1481.9144 1482.2593 1492.1517 1497.2189 1498.4590 1499.2350 1503.4888 1503.9608 1505.8211 1506.2506 1510.5780 1523.6330 1553.3139 1558.6742 1560.5220 1569.6076 1573.2883 1573.8475 1577.8094 1590.6503 1597.7767 1600.0882 1620.8589 1621.3464 1628.4678 1675.8360 1679.8928 1680.3031 1694.2446 1694.8873 1716.1020 1717.5901 1718.1993 1728.1050 1732.3471 1738.3543 1743.2645 1746.3822 1749.4822 3142.9313 3173.5706 3235.8322 3236.1182 3236.9014 3237.6976 3238.3911 3239.0419 3239.7058 3240.0786 3240.7429 3245.4896 3249.0928 3258.0564 3258.3932 3258.7677 3259.0527 3268.1396
redmass: 14.8609 6.3862 20.8778 6.7241 6.6952 5.6080 29.6045 6.0999 6.1545 6.1869 5.2314 5.3062 5.0176 4.9768 5.4572 6.2835 6.2402 9.2536 9.2643 6.8555 6.8445 5.7862 4.8909 5.4049 11.1880 8.4243 8.5993 5.6106 5.8269 7.7971 5.6502 5.6681 7.4514 5.8403 5.5306 6.1147 6.8353 6.9264 4.1348 4.0936 7.1721 3.7620 7.1816 5.4206 6.8525 5.8068 5.9292 6.4776 6.2913 6.0470 6.2607 6.2812 5.2649 5.5564 5.5035 5.9050 5.7565 6.0345 8.9877 8.9921 3.8915 5.6717 5.7129 6.7571 6.9771 3.8511 4.0066 7.3206 6.8046 7.3456 8.0849 7.6904 3.9381 4.0506 4.2352 5.0207 7.7675 5.5275 5.5378 5.5153 5.4607 7.2856 8.6532 7.4707 7.4984 7.3096 1.3786 1.4123 1.4476 1.5423 6.8472 1.5375 9.2765 6.8009 6.6454 6.5702 6.6820 1.4290 5.1031 1.4994 1.5342 5.9495 1.5684 1.5969 1.5908 1.3124 1.3189 1.3258 1.3260 1.2878 6.2884 6.2772 7.6602 7.8274 9.2236 1.3405 3.8641 3.9059 1.3087 2.9040 1.6720 3.1658 2.0272 2.0670 1.7090 1.2808 1.5216 2.2775 1.4631 1.7457 1.5117 1.3651 1.3759 1.4134 2.4891 2.2750 2.0556 2.6560 2.5374 2.4064 8.5009 3.2349 3.2511 7.4352 7.5865 2.7365 2.9382 3.5067 9.8196 6.7640 6.6006 4.5636 4.3935 6.9142 7.0751 1.8105 7.0317 6.7261 10.2764 4.7513 6.3131 6.1074 5.7431 4.0911 5.3656 3.6335 3.3377 9.6929 6.2986 4.2342 4.0315 9.6452 9.2599 9.3060 5.2033 6.5615 7.7378 7.5561 8.6426 8.4537 7.6703 5.6646 8.4219 8.5684 6.9537 6.9398 6.9874 10.8107 7.3003 7.5904 9.5971 9.6767 7.9657 7.9742 7.4503 1.0996 1.0987 1.0887 1.0890 1.0890 1.0886 1.0882 1.0885 1.0884 1.0882 1.0894 1.0880 1.0918 1.0968 1.0968 1.0967 1.0967 1.0968
irintensity: 9.0504 0.0037 12.9748 0.1062 5.6523 0.0315 78.5432 0.4303 0.0006 0.0082 0.0331 0.0008 0.0104 0.0190 7.2631 0.0010 1.6075 0.0258 3.0537 5.0258 8.3591 0.0044 0.2416 0.0000 0.0306 2.7867 0.2545 0.0006 0.0018 0.0005 0.0221 0.0207 0.0028 0.0004 0.0052 0.0054 0.8917 0.0134 0.0093 0.0089 0.3129 0.0037 0.5850 1.1993 0.2693 2.3190 4.0914 0.0602 0.0087 0.3936 0.0507 0.6521 21.1431 0.0784 1.6054 0.4797 2.8573 0.0011 0.3219 0.8850 0.0286 0.7321 1.3674 0.2176 0.1302 0.0026 0.1215 0.9434 6.7881 1.3136 0.0454 1.6786 0.0037 0.3829 47.7401 2.3281 0.2464 0.0060 0.0031 0.0086 0.0690 0.0384 0.2072 1.8528 0.1592 0.7001 27.3160 0.0219 5.5608 0.1426 0.3020 3.3479 5.7621 1.6935 0.2258 9.0660 4.9420 1.0439 1.6051 0.3499 0.2332 0.0989 5.9123 94.2234 60.8776 0.0022 0.0364 0.0013 0.0323 2.3446 0.1505 0.1168 4.8963 2.5161 1.2720 8.6686 10.9458 9.6788 1.5539 0.4927 3.1980 6.0478 6.3966 1.6913 12.9880 12.0845 13.4829 1.9925 2.8435 2.4296 1.5838 0.3019 1.7631 6.9955 1.1603 0.5125 4.8188 18.6329 3.6410 5.0809 64.9357 3.5009 10.6063 36.3982 32.2003 1.5633 0.3570 5.9981 27.7084 3.6794 2.7199 0.4097 4.7655 2.4684 3.9504 4.6776 13.9811 16.4020 0.6613 1.7742 1.3255 1.1472 5.8735 0.9986 6.6067 2.1761 12.2897 2.0641 0.0687 4.8695 3.4343 9.0413 4.1129 0.7193 0.1251 2.8943 0.0308 1.1859 12.1137 5.1461 7.2601 0.0301 2.9757 11.3995 0.6891 0.8222 8.9706 0.7762 4.1917 1.5305 56.6019 4.8251 24.0384 10.4579 0.1357 268.4918 401.0689 0.2445 6.8027 12.6442 7.3545 3.3427 26.6112 11.3995 0.0652 6.1361 18.8246 18.3439 5.3567 57.9799 110.9526 34.8593 14.2115
temp: 298.150 k
press: 1.00000 atm
elementType: 6 6 6 6 6 6 6 6 6 6 6 6 6 6 6 6 6 6 6 6 6 6 6 6 6 6 6 6 6 6 6 6 6 6 6 6 6 6 6 6 6 6 6 6 6 6 6 6 6 6 6 6 6 6 1 1 1 1 1 1 1 1 1 1 1 1 1 1 1 1 1 1 17
symmnumber: 1
zpe: 1441846.7 jmol-1
zpe.correction: 0.549170 hartree
zpe.thermalcorrener: 0.580598 hartree
zpe.thermalcorrenthalpy: 0.581542 hartree
zpe.thermalcorrgfe: 0.490139 hartree
zpe.sumelectzpe: -2525.591634 hartree
zpe.sumelectthermal: -2525.560206 hartree
zpe.sumelectthermalent: -2525.559262 hartree
zpe.sumelectthermalfe: -2525.650665 hartree
dipole: -28.6231 0.1607 0.0027
dipole: 28.6235
quadrupole: -575.5958 -297.1426 -332.3670
quadrupole: 0.6078 0.0245 -0.0003
quadrupole: -173.8940 104.5592 69.3348 0.6078 0.0245 -0.0003
hfenergy: -2526.1408041 hartree
pointgroup: C01 [X(C54H18Cl1)]
dipole: -11.2611933 -0.0632163 -0.0010525 debye
polarizability: 1078.519254|-1.1771477|1024.2332464|-0.0022918|-0.000992|258.1515134 unknown
InChI: InChI=1/54C.Cl.18H
charge -1 multiplicity 1
73 atoms
C  0.429955 1.112264 -0.000029
C  0.965656 -0.185114 0.000007
C  0.109453 -1.296762 -0.000075
C  -1.281024 -1.111582 0.000005
C  -1.816437 0.185094 0.000084
C  -0.960308 1.29693 -0.000061
C  -0.642077 3.718512 -0.000061
C  -1.500624 2.607076 0.000054
C  -0.204686 -3.717702 -0.000046
C  -1.185378 5.022461 -0.00006
C  -2.561832 5.184431 -0.000035
C  0.341439 -5.019183 -0.000067
C  1.629003 4.643023 -0.000094
C  0.759499 3.530729 -0.000041
C  -2.472584 -4.648476 0.000043
C  -1.607256 -3.532301 0.000021
C  1.049849 5.948246 -0.000123
C  -0.283161 6.129371 -0.000108
C  -1.892325 -5.952796 0.000017
C  -0.558338 -6.127314 -0.000035
C  2.999613 4.437663 -0.000094
C  -5.985096 0.739725 0.00011
C  3.224917 0.740841 -0.000066
C  2.368399 -0.370824 -0.000146
C  -4.07663 -0.741302 0.000102
C  -3.22072 0.371965 0.0000
C  2.68646 2.047183 -0.000061
C  1.295679 2.234444 -0.000043
C  -3.536537 -2.049282 0.000062
C  -2.144994 -2.23487 0.000048
C  5.477923 1.690402 -0.000074
C  4.620877 0.546004 -0.000163
C  -6.31578 -1.703618 0.000147
C  -5.475589 -0.549151 0.000113
C  4.960828 2.934326 -0.000027
C  3.551832 3.164001 -0.000066
C  -5.80211 -2.946673 0.000142
C  -4.392472 -3.172287 0.000103
C  2.582108 -4.094454 -0.00016
C  1.71857 -5.179497 -0.000125
C  -3.424643 4.09926 0.000004
C  2.044243 -2.787642 -0.00015
C  0.651801 -2.605879 -0.000032
C  -2.892192 2.791761 -0.000014
C  4.820726 -3.175732 -0.000275
C  4.002688 -4.244261 -0.000224
C  -5.665295 3.184737 0.000066
C  -4.84389 4.250066 0.000028
C  4.30676 -1.843698 -0.000254
C  2.906031 -1.666399 -0.000138
C  -5.156134 1.850982 0.000077
C  -3.755735 1.67051 0.000083
C  5.145175 -0.73915 -0.00027
C  -3.843926 -4.444969 0.000088
H  6.547711 1.503315 0.000005
H  -7.386085 -1.556866 0.000172
H  5.893606 -3.297701 -0.000316
H  -6.736686 3.323173 0.00008
H  6.227935 -0.845141 -0.000284
H  -4.502977 -5.302088 0.000113
H  1.713806 6.800458 -0.000164
H  -2.553571 -6.807071 0.000041
H  3.65967 5.293826 -0.000116
H  -7.05679 0.882356 0.000115
H  5.617984 3.791761 -0.000016
H  -6.457066 -3.805871 0.000168
H  2.131418 -6.178703 -0.000137
H  4.411268 -5.244162 -0.000208
H  -5.251287 5.250697 0.000021
H  -2.973929 6.184047 -0.000032
H  -0.697435 7.127083 -0.000134
H  -0.140753 -7.123702 -0.000051
Cl 8.508406 0.003415 0.000684
