program: Gaussian 16
title: Cl3-c54h18.plan opt
version: ES64L-G16RevA.03
basis: CBSB1
frameworkgroup: C2V[C2(Cl),SGV(C54H18)]
method: RHF
basis: STO-3G
operation: Freq
keyword: #P
keyword: freq=noraman
keyword: EmpiricalDispersion=GD3BJ
keyword: integral(grid=ultrafinegrid)
keyword: GFInput
keyword: pop=full
keyword: IOP(3/74=-78)
keyword: IOP(6/7=3)
keyword: IOP(3/5=10)
keyword: IOP(3/175=01217700)
keyword: IOP(3/177=414500)
keyword: IOP(3/178=4859300)
keyword: SCF=YQC
title: #P freq=noraman EmpiricalDispersion=GD3BJ integral(grid=ultrafinegrid)
nucrepener: 6852.9763975599
basis: NPDir=0 NMtPBC= 1 NCelOv= 1 NCel= 1 NClECP= 1 NCelD= 1
basis: NCelK= 1 NCelE2= 1 NClLst= 1 CellRange= 0.0.
basis: One-electron integrals computed using PRISM.
basis: One-electron integral symmetry used in STVInt
basis: NBasis= 1998 RedAO= T EigKep= 1.02D-06 NBF= 689 311 319 679
basis: NBsUse= 1929 1.00D-06 EigRej= 9.05D-07 NBFU= 658 310 319 642
converged: YES YES YES YES
title: Mulliken charges:
elementType: C C C C C C C C C C C C C C C C C C C C C C C C C C C C C C C C C C C C C C C C C C C C C C C C C C C C C C H H H H H H H H H H H H H H H H H H Cl
charge: -0.027981 0.048526 0.048526 -0.027981 0.020631 0.020631 0.142919 -0.176577 0.126370 0.528506 -0.342626 0.435453 0.416044 0.102501 0.496077 0.091187 -0.410781 -0.389439 -0.394534 -0.374023 -0.374583 -0.342626 0.126370 -0.204547 0.142919 -0.176577 0.091187 -0.197893 0.102501 -0.197893 -0.374023 0.435453 -0.389439 0.528506 -0.394534 0.496077 -0.410781 0.416044 0.205057 -0.391672 0.177312 0.089024 -0.204547 0.095221 -0.058770 -0.058770 -0.263168 -0.263168 0.205057 0.089024 0.177312 0.095221 -0.391672 -0.374583 0.107887 0.089154 0.012630 0.093332 0.067518 0.026850 0.093749 0.088162 0.026850 0.028983 0.088162 0.093749 0.067518 0.012630 0.093332 0.028983 0.089154 0.107887 -0.953000
chargesum: -1.00000
title: Mulliken charges with hydrogens summed into heavy atoms:
elementType: C C C C C C C C C C C C C C C C C C C C C C C C C C C C C C C C C C C C C C C C C C C C C C C C C C C C C C Cl
charge: -0.027981 0.048526 0.048526 -0.027981 0.020631 0.020631 0.142919 -0.176577 0.126370 0.528506 -0.313643 0.435453 0.416044 0.102501 0.496077 0.091187 -0.317032 -0.300285 -0.306372 -0.266136 -0.347733 -0.313643 0.126370 -0.204547 0.142919 -0.176577 0.091187 -0.197893 0.102501 -0.197893 -0.266136 0.435453 -0.300285 0.528506 -0.306372 0.496077 -0.317032 0.416044 0.205057 -0.324154 0.177312 0.089024 -0.204547 0.095221 -0.046139 -0.046139 -0.169836 -0.169836 0.205057 0.089024 0.177312 0.095221 -0.324154 -0.347733 -0.953000
polarizability: 2.58741129e+02 -9.37209143e-09 1.02428542e+03 2.45591232e-06 4.36823131e-06 1.07615451e+03
1716.lowfreq: -1.7139 -1.2249 -0.0005 0.0006 0.0009 3.9743 15.1278 22.4347 41.8619
frequency: 15.1245 22.4334 41.8619 45.0840 58.1608 82.0520 97.5413 106.1677 132.7061 136.4959 150.7493 153.8257 225.5796 226.2148 239.5803 240.3508 243.8059 262.7343 264.4147 279.4019 279.6173 299.6082 305.0789 319.5859 348.2745 357.3533 358.0355 361.9993 381.6028 389.6256 390.0356 391.0017 395.4522 397.3922 398.8762 408.2161 411.1009 411.2944 468.8927 471.4095 489.3833 489.4695 491.2933 507.1119 512.0540 519.9891 520.1991 546.1716 548.1918 549.9844 551.5199 557.8980 568.9318 569.1826 569.8945 576.0256 576.8357 589.5365 598.0247 598.4804 614.9898 615.9654 616.9790 646.3395 648.3254 651.8208 655.2040 655.8734 679.4817 680.1461 680.9713 681.2166 704.9723 708.7729 738.5239 746.5207 748.4413 775.0707 775.7418 778.0807 779.9456 786.4865 788.6994 798.0229 799.3318 824.8978 826.1645 835.0861 843.5486 855.2522 860.2466 860.3322 874.2877 875.1753 877.4255 879.1177 879.2037 903.5937 907.8804 927.5567 935.5820 935.8543 941.2498 946.1265 960.6096 978.3727 1021.3109 1022.2157 1023.6744 1028.8479 1029.0455 1041.0197 1042.3335 1051.4247 1052.4550 1059.8063 1082.4171 1086.3436 1102.2758 1146.3120 1155.2288 1158.2453 1175.2943 1177.1570 1185.0264 1211.5213 1212.7242 1213.4046 1214.9501 1221.7937 1223.0471 1239.2653 1240.8325 1256.5423 1270.3265 1293.3105 1318.5826 1333.5097 1337.8427 1339.2502 1347.4652 1348.6054 1349.8375 1375.4264 1375.4535 1376.0876 1377.3587 1399.4642 1422.7775 1425.1259 1426.3051 1449.5419 1450.7558 1471.2251 1472.9637 1473.3982 1482.0080 1482.0679 1491.5717 1495.9616 1497.2668 1498.5355 1503.7948 1503.9402 1505.0659 1505.2589 1506.4661 1523.7912 1553.6718 1558.5137 1559.8891 1569.4245 1572.8889 1573.8868 1576.8884 1590.6567 1597.9734 1599.2997 1620.6843 1620.8313 1627.8328 1675.2487 1678.9534 1680.1849 1694.1126 1694.8996 1715.4642 1717.0296 1718.2581 1728.0346 1733.8351 1738.0341 1744.5029 1745.6836 1749.8277 3227.9554 3234.6966 3236.5456 3236.9547 3237.4715 3238.0839 3239.2923 3240.1121 3240.6063 3242.1967 3242.2441 3252.3188 3252.4108 3258.6697 3258.9864 3259.3161 3262.0465 3262.1400
redmass: 19.9972 14.9762 6.3627 6.6904 6.5907 5.7406 30.2950 6.0027 6.1370 6.2391 5.1988 5.3998 4.9619 4.9949 5.6178 6.2684 6.1000 9.2525 9.2463 6.8520 6.8224 5.8379 4.8236 5.3663 8.4133 8.5671 5.5912 5.8426 7.6251 5.6426 5.6143 9.3504 5.8942 5.3651 7.2427 6.8090 7.1302 6.8357 4.0971 4.0580 7.1410 7.1275 3.5936 5.4016 6.7526 5.7391 5.7952 6.2050 6.2366 6.3169 6.1545 6.1225 5.1160 5.4640 5.2682 5.9570 5.8887 6.0124 8.9747 8.9631 3.9128 5.6283 5.6550 6.8387 6.8688 3.8537 4.0604 7.3495 6.9322 7.1648 7.7538 8.0077 3.9382 4.1407 4.2568 7.7104 5.0989 5.4172 5.5723 5.4833 6.0884 6.4489 8.5474 7.3941 7.4370 8.4682 1.3475 1.4161 1.4373 1.5409 6.8007 1.5706 6.5101 9.5808 6.6490 6.5767 6.5715 5.0497 1.3154 1.4942 5.8410 1.5341 1.5532 1.5988 1.5110 1.5372 1.3128 1.3200 1.3263 1.3293 1.3324 6.2427 6.3057 7.7327 7.8468 9.2746 3.7548 3.8646 1.2983 3.0545 1.5803 3.2160 2.0717 2.0135 1.6272 1.8633 1.1988 1.2953 2.1994 1.6276 1.5751 1.3709 1.3542 1.3488 2.5764 2.2275 2.0453 2.7102 2.3935 2.4355 3.2122 6.4885 3.7211 8.1961 8.0945 2.8634 2.8336 3.5985 10.1560 6.7003 6.9520 4.3326 4.5726 1.6900 7.5060 7.8436 6.5326 7.0558 10.4317 5.4618 4.7636 7.8131 3.3474 8.6147 2.8061 6.8811 5.2713 10.0658 6.4746 4.3782 4.2144 10.0368 9.0182 9.5665 5.6715 6.4712 7.7494 7.8429 8.5269 8.6964 7.8766 6.0078 8.7497 8.5628 7.1715 7.0932 7.2771 11.7114 7.0813 7.6430 9.6573 9.9797 8.1792 8.0303 7.4778 1.0905 1.0988 1.0887 1.0889 1.0892 1.0904 1.0872 1.0878 1.0881 1.0871 1.0871 1.0915 1.0915 1.0968 1.0968 1.0968 1.0967 1.0967
irintensity: 11.5903 10.7434 0.0000 0.0880 5.2433 0.2654 69.4256 0.0000 0.0000 0.0146 0.0000 0.0007 0.0000 0.1499 5.6804 0.0000 3.0472 0.0006 3.1278 3.5627 6.5844 0.0030 0.3062 0.0000 2.4833 1.5047 0.0000 0.0155 0.0000 0.0041 0.0224 0.0146 0.0000 0.0003 0.0000 0.0010 0.0000 0.0970 0.0000 0.0004 0.0437 1.0712 0.0000 0.0310 0.0145 3.7355 6.8181 0.0000 0.3525 0.0040 0.0485 0.0000 14.2211 0.0000 11.7607 0.0000 1.3614 0.0000 0.2635 1.9642 0.0443 0.0266 0.1780 0.0032 0.0979 0.0000 0.4745 0.0120 6.6054 4.1921 2.2586 1.1041 0.0000 1.9710 46.8072 0.0210 0.0000 0.0042 0.0000 0.0246 0.0000 0.0000 0.0312 0.0108 1.1033 0.0000 27.8632 0.0000 4.2133 0.0000 0.1237 0.4826 0.7209 2.2250 0.0020 6.5024 6.1876 0.0229 0.0081 0.0000 0.0019 0.5459 0.0000 116.6758 0.0000 63.3699 0.0000 0.0862 0.0000 0.0000 0.6608 0.0074 0.0000 0.0674 0.6810 0.0327 8.4026 8.3809 0.0000 0.0156 0.0005 3.5456 0.0663 8.3701 6.4161 1.4575 103.7609 21.5186 10.8090 0.0237 5.4761 0.0008 0.1665 0.0530 7.5768 0.2249 0.4796 41.8032 0.7523 0.0602 7.3506 37.2893 0.6090 22.3251 44.3265 0.0493 0.2381 0.0094 31.1135 0.0076 13.9653 2.4534 0.0001 0.1856 1.8861 5.2811 17.7244 2.7263 2.0982 0.0060 1.0011 0.2677 0.5728 0.2062 0.1902 5.0129 3.8794 1.1356 0.0198 0.7568 1.9018 29.4150 4.2159 0.6638 0.9809 1.2157 0.0743 8.0319 6.8960 12.1015 11.8118 16.8530 8.4639 0.9283 7.7961 1.1267 19.2742 0.1509 0.0993 0.0852 10.9715 35.9152 54.7784 11.6753 0.8234 0.0778 171.0203 0.0696 4.0108 17.4260 8.7407 11.8869 10.3430 1.5928 15.6549 0.3178 0.8052 3.5730 5.0772 68.8005 76.4438 69.7600 14.1799
temp: 298.150 k
press: 1.00000 atm
elementType: 6 6 6 6 6 6 6 6 6 6 6 6 6 6 6 6 6 6 6 6 6 6 6 6 6 6 6 6 6 6 6 6 6 6 6 6 6 6 6 6 6 6 6 6 6 6 6 6 6 6 6 6 6 6 1 1 1 1 1 1 1 1 1 1 1 1 1 1 1 1 1 1 17
symmnumber: 2
zpe: 1442372.3 jmol-1
zpe.correction: 0.549371 hartree
zpe.thermalcorrener: 0.580786 hartree
zpe.thermalcorrenthalpy: 0.581730 hartree
zpe.thermalcorrgfe: 0.489968 hartree
zpe.sumelectzpe: -2525.584743 hartree
zpe.sumelectthermal: -2525.553327 hartree
zpe.sumelectthermalent: -2525.552383 hartree
zpe.sumelectthermalfe: -2525.644145 hartree
dipole: 0.0000 -0.0000 -32.2466
dipole: 32.2466
quadrupole: -332.3751 -292.7053 -621.4968
quadrupole: -0.0000 -0.0000 0.0000
quadrupole: 83.1506 122.8204 -205.9710 -0.0000 -0.0000 0.0000
hfenergy: -2526.1341131 hartree
pointgroup: C02V [C2(Cl1),SGV(C54H18)]
dipole: 0. 0. -12.6868006 debye
polarizability: 258.7411294|0.|1024.2854211|0.0000025|0.0000044|1076.1545112 unknown
InChI: InChI=1/54C.Cl.18H
charge -1 multiplicity 1
73 atoms
C  0.0000 1.402674 -0.448183
C  0.0000 0.701716 0.767151
C  0.0000 -0.701716 0.767151
C  0.0000 -1.402674 -0.448183
C  0.0000 -0.701277 -1.663513
C  0.0000 0.701277 -1.663513
C  0.0000 2.814147 -2.889671
C  0.0000 1.409842 -2.890741
C  0.0000 -2.811368 1.993516
C  0.0000 3.515481 -4.115248
C  0.0000 2.804184 -5.305388
C  0.0000 -3.50926 3.221369
C  0.0000 4.932324 -1.657344
C  0.0000 3.520985 -1.663852
C  0.0000 -4.932019 0.7650
C  0.0000 -3.519155 0.769601
C  0.0000 5.613352 -2.911425
C  0.0000 4.942348 -4.077447
C  0.0000 -5.612252 2.020959
C  0.0000 -4.936894 3.183999
C  0.0000 5.606324 -0.445525
C  0.0000 -2.804184 -5.305388
C  0.0000 2.811368 1.993516
C  0.0000 1.408856 1.994976
C  0.0000 -2.814147 -2.889671
C  0.0000 -1.409842 -2.890741
C  0.0000 3.519155 0.769601
C  0.0000 2.819564 -0.447892
C  0.0000 -3.520985 -1.663852
C  0.0000 -2.819564 -0.447892
C  0.0000 4.936894 3.183999
C  0.0000 3.50926 3.221369
C  0.0000 -4.942348 -4.077447
C  0.0000 -3.515481 -4.115248
C  0.0000 5.612252 2.020959
C  0.0000 4.932019 0.7650
C  0.0000 -5.613352 -2.911425
C  0.0000 -4.932324 -1.657344
C  0.0000 -1.410641 4.435432
C  0.0000 -2.79912 4.410462
C  0.0000 1.418757 -5.326223
C  0.0000 -0.706531 3.209974
C  0.0000 -1.408856 1.994976
C  0.0000 0.707441 -4.106329
C  0.0000 0.673017 5.654588
C  0.0000 -0.673017 5.654588
C  0.0000 -0.672405 -6.543446
C  0.0000 0.672405 -6.543446
C  0.0000 1.410641 4.435432
C  0.0000 0.706531 3.209974
C  0.0000 -1.418757 -5.326223
C  0.0000 -0.707441 -4.106329
C  0.0000 2.79912 4.410462
C  0.0000 -5.606324 -0.445525
H  0.0000 5.469876 4.123396
H  0.0000 -5.47909 -5.014914
H  0.0000 1.170074 6.616282
H  0.0000 -1.216689 -7.476616
H  0.0000 3.332848 5.349851
H  0.0000 -6.687481 -0.445119
H  0.0000 6.693675 -2.90594
H  0.0000 -6.692444 2.017791
H  0.0000 6.687481 -0.445119
H  0.0000 -3.344852 -6.241618
H  0.0000 6.692444 2.017791
H  0.0000 -6.693675 -2.90594
H  0.0000 -3.332848 5.349851
H  0.0000 -1.170074 6.616282
H  0.0000 1.216689 -7.476616
H  0.0000 3.344852 -6.241618
H  0.0000 5.47909 -5.014914
H  0.0000 -5.469876 4.123396
Cl 0.0000 0.0000 8.984481
