program: Gaussian 16
title: Cl3-c150h30 opt
version: ES64L-G16RevC.02
basis: CBSB1
frameworkgroup: C1[X(C150H30Cl)]
method: RHF
basis: STO-3G
operation: FOpt
keyword: #P
keyword: opt
keyword: EmpiricalDispersion=GD3BJ
keyword: integral(grid=ultrafinegrid)
keyword: GFInput
keyword: pop=full
keyword: IOP(3/74=-78)
keyword: IOP(6/7=3)
keyword: IOP(3/5=10)
keyword: IOP(3/175=01217700)
keyword: IOP(3/177=414500)
keyword: IOP(3/178=4859300)
keyword: SCF=YQC
title: #P opt=Restart EmpiricalDispersion=GD3BJ integral(grid=ultrafinegrid)
converged: YES YES NO NO
nucrepener: 32175.5662787534
basis: NPDir=0 NMtPBC= 1 NCelOv= 1 NCel= 1 NClECP= 1 NCelD= 1
basis: NCelK= 1 NCelE2= 1 NClLst= 1 CellRange= 0.0.
basis: One-electron integrals computed using PRISM.
basis: One-electron integral symmetry used in STVInt
basis: NBasis= 5334 RedAO= T EigKep= 1.00D-06 NBF= 5334
basis: NBsUse= 5095 1.00D-06 EigRej= 9.60D-07 NBFU= 5095
converged: YES YES YES YES
title: Mulliken charges:
elementType: C C C C C C C C C C C C C C C C C C C C C C C C C C C C C C C C C C C C C C C C C C C C C C C C C C C C C C C C C C C C C C C C C C C C C C C C C C C C C C C C C C C C C C C C C C C C C C C C C C C C C C C C C C C C C C C C C C C C C C C C C C C C C C C C C C C C C C C C C C C C C C C C C C C C C C H H H H H H H H H H H H H H H H H H H H H H H H H H H H H H Cl
charge: -0.043257 -0.077076 0.035278 -0.005382 0.018151 0.037040 0.134154 -0.174028 0.120419 0.440846 -0.578770 0.428881 0.075556 -0.088970 0.086181 -0.132185 0.326003 -0.380593 0.318255 -0.371641 0.305578 0.133123 0.323859 0.103771 -0.170117 -0.204621 -0.207700 -0.220771 -0.369265 -0.374387 -0.020037 0.007645 -0.029319 0.075956 -0.133092 0.030963 -0.021713 -0.069405 0.018775 0.010141 0.033073 -0.091587 -0.011834 -0.042504 -0.208757 -0.100421 -0.181113 -0.077146 0.155888 -0.175525 0.146238 -0.147608 0.407428 0.145668 0.407335 0.135378 -0.584518 0.401488 -0.586187 0.426703 -0.384778 -0.368052 0.096494 -0.026379 0.004091 -0.009580 0.142264 -0.016329 0.008933 -0.030402 0.087809 0.206402 -0.016075 0.045661 0.073355 0.180013 -0.019547 0.028027 0.081061 -0.155528 0.101208 -0.125465 0.110455 -0.180030 0.093406 -0.136322 -0.210402 0.337031 -0.212239 0.301017 -0.199254 0.314355 -0.214622 0.301903 0.059078 -0.059876 0.083812 -0.026194 0.033243 -0.051410 -0.042841 -0.002115 -0.018391 -0.079051 0.019481 -0.054812 0.011556 -0.005107 0.151929 -0.084415 0.129721 -0.154800 -0.243080 -0.073940 -0.168292 -0.079628 -0.579182 0.418551 -0.592389 0.427977 0.425749 0.117022 0.403662 0.121177 -0.381284 -0.362887 0.440779 -0.586142 0.425270 0.115502 -0.184995 0.144716 0.323134 -0.383676 0.314078 -0.365638 0.086606 -0.137936 0.086945 -0.112167 -0.197388 -0.206561 -0.188906 -0.210010 0.303946 0.084864 0.306904 0.115092 -0.365742 -0.369492 0.102010 0.104838 0.018600 0.021379 0.019309 0.022855 0.104518 0.104684 0.021392 0.023209 0.104773 0.104026 0.021867 0.022937 0.019723 0.021425 0.019143 0.022992 0.101870 0.105028 0.019517 0.020783 0.023681 0.102614 0.104548 0.019557 0.021711 0.022712 0.102988 0.104848 -1.030712
chargesum: -1.00000
totalkineticener: 6.165647729583D+03
dipole: 10.4399 -0.0307 -9.3513
dipole: 14.0157
quadrupole: -867.7206 -816.3987 -904.3195
quadrupole: -0.0724 46.9218 0.0176
quadrupole: -4.9077 46.4142 -41.5066 -0.0724 46.9218 0.0176
hfenergy: -6187.3821103 hartree
pointgroup: C01 [X(C150H30Cl1)]
dipole: -2.3390015 -3.3466122 -3.7061432 debye
InChI: InChI=1/150C.Cl.30H
charge -1 multiplicity 1
181 atoms
C  -0.0002463 1.4076902 -0.06905063
C  1.21592232 0.7064229 -0.07181114
C  1.215022 -0.69796152 -0.05630529
C  -0.00069289 -1.40148665 -0.04687003
C  -1.21702303 -0.69977641 -0.04546211
C  -1.21593502 0.70481161 -0.0543982
C  -6.09714696 4.92627894 -0.00174854
C  -6.09948151 3.52199212 -0.01131002
C  6.09515738 -4.9211385 0.00100259
C  -7.3271599 5.63395212 0.01168834
C  -8.5184005 4.91871436 0.01691681
C  7.32544665 -5.62726241 0.01568021
C  -4.8712815 7.03755494 0.00390899
C  -4.87617673 5.63270205 -0.01050698
C  4.87020094 -7.03378562 0.00927165
C  4.87519757 -5.62875879 -0.00292141
C  -6.11565132 7.74152892 0.0193967
C  -7.29026188 7.04872411 0.02222366
C  6.11508753 -7.73669047 0.02084841
C  7.28841867 -7.04235437 0.02433419
C  -3.64566373 9.16543342 0.01766285
C  -3.65857233 7.73601581 -0.00069589
C  3.64627044 -9.16395883 0.01886285
C  3.65885086 -7.73426599 0.00688602
C  -4.9118628 9.84674368 0.0344602
C  -6.07136318 9.17935236 0.03449908
C  4.91376783 -9.84415377 0.02961498
C  6.07179122 -9.17423225 0.03082323
C  -2.45760868 9.83401832 0.0201266
C  -9.7495421 -2.78853955 0.01405784
C  -2.43753704 2.81434822 -0.04387057
C  -2.43879406 1.40935946 -0.04725763
C  2.43713201 -2.80884065 -0.03620692
C  -3.65650623 3.5157491 -0.03445205
C  -4.87180509 2.81357304 -0.01804882
C  3.65484341 -3.51148617 -0.02378356
C  -1.21513892 4.92354009 -0.04974724
C  -1.21584808 3.51889556 -0.05839673
C  1.21504775 -4.92141881 -0.01795583
C  1.21590038 -3.51527367 -0.03093251
C  -2.4398743 5.62745027 -0.03375227
C  -3.65428213 4.92835823 -0.02135218
C  2.43980965 -5.62606164 -0.01558927
C  3.6529588 -4.92430204 -0.0123716
C  -0.00000957 7.04000078 -0.03708854
C  0.00184688 5.62281407 -0.05947966
C  -0.00030201 -7.04058061 -0.00370113
C  -0.00056868 -5.62330603 -0.01793389
C  -1.21657136 7.74016154 -0.01903466
C  -2.43942481 7.03794311 -0.01532961
C  1.21706162 -7.74069102 -0.00050494
C  2.43933014 -7.03645671 0.0009506
C  1.21377248 9.15778747 -0.00475273
C  1.21594833 7.73952754 -0.03261508
C  -1.21434157 -9.1598304 0.00934569
C  -1.21748177 -7.74113313 -0.0009089
C  -0.00016929 9.83288741 0.01043838
C  -1.2140992 9.15834647 0.00358823
C  0.00032755 -9.83407505 0.0149467
C  1.214816 -9.15964512 0.01165618
C  2.45639432 9.83507584 0.0101166
C  -7.29004079 -7.04672752 0.01174162
C  2.43628912 2.81475 -0.10166564
C  2.43643847 1.41364058 -0.0866461
C  -2.43932734 -2.81094759 -0.02790925
C  -2.43889617 -1.40578432 -0.03634101
C  1.21619196 3.51870121 -0.09422171
C  0.00160486 2.81870183 -0.07776754
C  -1.21737171 -3.51607423 -0.02850362
C  -0.00089441 -2.81275 -0.03507902
C  3.64962578 4.92767827 -0.08764849
C  3.65188429 3.51674293 -0.09717618
C  -3.65496598 -4.92655913 -0.01383052
C  -3.65727875 -3.51351947 -0.01942292
C  2.43889399 5.62698928 -0.0808856
C  1.21570102 4.922966 -0.08166461
C  -2.44113564 -5.62701129 -0.01225216
C  -1.2164786 -4.92213441 -0.01865818
C  4.86548137 7.03525424 -0.03168398
C  4.86813451 5.63102737 -0.05826518
C  -4.87146782 -7.03641285 0.00186841
C  -4.87694553 -5.6313934 -0.00448958
C  3.6548132 7.73475698 -0.02896189
C  2.43734658 7.0344225 -0.050463
C  -3.65939775 -7.73587326 0.00288706
C  -2.44010048 -7.03773344 -0.00399387
C  6.06683592 9.1773231 0.02520974
C  6.10898387 7.7399343 -0.00107037
C  -6.07169674 -9.17770049 0.01756233
C  -6.11590923 -7.74005222 0.01015732
C  4.90876167 9.846309 0.02592341
C  3.64279124 9.16398734 0.00135616
C  -4.91294182 -9.8463863 0.01821027
C  -3.64605801 -9.16541058 0.01148879
C  4.8695319 -1.40474004 -0.03437552
C  4.86951828 -2.80833388 -0.02479817
C  -4.87292569 1.41005909 -0.02778275
C  3.65258142 -0.69995285 -0.05133434
C  2.43683316 -1.40417826 -0.04841711
C  -3.65534523 0.70705946 -0.03322592
C  6.08885404 0.70512252 -0.04110891
C  6.09137556 -0.69612538 -0.0294419
C  -6.09596451 -0.69983111 -0.01748717
C  -6.09532036 0.70166551 -0.01135411
C  4.86702778 1.41347771 -0.06191708
C  3.65163742 0.71002344 -0.06767882
C  -4.87313406 -1.40785264 -0.02074859
C  -3.65602566 -0.70377877 -0.03034461
C  7.30612787 2.8210097 -0.0279611
C  7.30999363 1.41088131 -0.02393916
C  -7.31523693 -2.81649071 -0.00351308
C  -7.316969 -1.40585109 -0.0022778
C  6.09134766 3.52358559 -0.04933738
C  4.86404961 2.8164825 -0.07779994
C  -6.10002049 -3.52031752 -0.00677267
C  -4.87272958 -2.81154455 -0.01811296
C  8.51016064 4.92069327 0.00656166
C  8.53297511 3.53226414 -0.00141835
C  -8.51914402 -4.91731406 0.01040582
C  -8.54266498 -3.52832866 0.00702786
C  7.31797453 5.63329448 -0.01015612
C  6.08926518 4.92604544 -0.04149986
C  -7.32766588 -5.63178936 0.00612851
C  -6.09769945 -4.92471852 -0.00327738
C  7.28312462 7.04806272 0.00684058
C  -2.45830366 -9.83510273 0.0143719
C  8.53977718 -3.52332255 0.01533699
C  8.51639078 -4.91262702 0.02262829
C  -8.54138861 3.52995803 0.01033087
C  7.31166793 -2.81239896 -0.00238948
C  6.09695066 -3.51695725 -0.00771588
C  -7.31441882 2.81795648 -0.00064547
C  9.75842792 -1.42005266 0.02135331
C  9.74632314 -2.78372268 0.02649512
C  -9.76224046 1.4266349 0.01416196
C  -9.74814013 2.78995387 0.01718403
C  8.52637066 -0.69487366 0.00144287
C  7.31235882 -1.40176722 -0.01031466
C  -8.53079748 0.70036669 0.00506195
C  -7.31674515 1.40757134 -0.00778686
C  10.97897437 0.67531379 0.03605386
C  10.98128484 -0.66251071 0.03771027
C  -10.98589912 -0.66790061 0.02183391
C  -10.9852978 0.66993183 0.02262241
C  9.75561903 1.43072769 0.01586823
C  8.52425685 0.70465562 -0.0040305
C  -9.76282979 -1.42509708 0.01280223
C  -8.5312339 -0.6989527 0.00193785
C  9.74018184 2.79380674 0.01798639
C  2.45908253 -9.83460734 0.01998899
H  7.00588403 9.71081363 0.0492776
H  -7.01004418 -9.71279944 0.02350863
H  9.44552589 5.46177887 0.03213825
H  -9.45497628 -5.4579366 0.01838019
H  8.21903674 7.58831779 0.03378663
H  -2.45868344 -10.91603251 0.02190123
H  11.91069673 1.22188078 0.05166715
H  -11.91849082 -1.21293028 0.02923364
H  10.67588487 3.33496273 0.03797286
H  2.45982801 -10.91548279 0.02953457
H  -4.90483 10.9269347 0.0485828
H  4.90839157 -10.92431116 0.03809784
H  -2.45723152 10.91497254 0.03757248
H  -10.6858482 -3.32858091 0.02254375
H  0.00034186 10.91354653 0.03265402
H  0.00031728 -10.91483995 0.02387481
H  2.45633145 10.91572558 0.03541809
H  -8.22578638 -7.58781807 0.01880213
H  4.90145797 10.92626687 0.05027459
H  -4.90679631 -10.92656715 0.0246459
H  9.45241452 -5.45290384 0.0360347
H  10.68277749 -3.3233078 0.04224514
H  -10.68443483 3.33019414 0.02569521
H  11.91406453 -1.2070092 0.05425196
H  -11.9176547 1.21545222 0.03041293
H  -9.45449403 5.45892354 0.02740249
H  -8.22598851 7.58966263 0.03463682
H  8.22460134 -7.58276657 0.03504127
H  -7.00945518 9.71471681 0.04818685
H  7.01058938 -9.70857796 0.04012664
Cl 2.72320154 3.92199142 2.93796085
