program: Gaussian 16
title: 1F_isomer_2 opt
version: ES64L-G16RevC.02
basis: CBSB1
frameworkgroup: C1[X(C10H7F)]
method: RHF
basis: STO-3G
operation: FOpt
keyword: #P
keyword: opt
keyword: EmpiricalDispersion=GD3BJ
keyword: integral(grid=ultrafinegrid)
keyword: GFInput
keyword: pop=full
keyword: IOP(3/74=-78)
keyword: IOP(6/7=3)
keyword: IOP(3/5=10)
keyword: IOP(3/175=01217700)
keyword: IOP(3/177=414500)
keyword: IOP(3/178=4859300)
keyword: SCF=YQC
title: #P opt EmpiricalDispersion=GD3BJ integral(grid=ultrafinegrid) GFInput
nucrepener: 542.6807006770
basis: NPDir=0 NMtPBC= 1 NCelOv= 1 NCel= 1 NClECP= 1 NCelD= 1
basis: NCelK= 1 NCelE2= 1 NClLst= 1 CellRange= 0.0.
basis: One-electron integrals computed using PRISM.
basis: One-electron integral symmetry used in STVInt
basis: NBasis= 416 RedAO= T EigKep= 1.57D-06 NBF= 416
basis: NBsUse= 414 1.00D-06 EigRej= 6.29D-07 NBFU= 414
converged: YES YES YES YES
title: Mulliken charges:
elementType: C C C C C C C C C C F H H H H H H H
charge: 0.451533 0.223211 -0.328503 -0.332612 -0.307882 -0.362574 0.348387 -0.004037 -0.184935 -0.068473 -0.222506 0.101376 0.090727 0.118304 0.094257 0.147065 0.120343 0.116318
chargesum: 0.00000
charge: 0.473645 0.181934 -0.283530 -0.337682 -0.376976 -0.353834 0.339094 0.002286 -0.153706 -0.050669 -0.209236 0.096582 0.085695 0.116742 0.090493 0.145732 0.118697 0.114735
chargesum: -0.00000
dipole: -1.5164 0.6295 -0.0000
dipole: 1.6419
quadrupole: -61.8591 -53.9806 -67.4965
quadrupole: 2.6122 -0.0000 -0.0000
quadrupole: -0.7470 7.1315 -6.3844 2.6122 -0.0000 -0.0000
hfenergy: -484.46897 hartree
pointgroup: C01 [X(C10H7F1)]
dipole: -0.5630306 0.3073815 -0.0759747 debye
InChI: InChI=1/10C.F.7H
charge 0 multiplicity 1
18 atoms
C  0.01822855 -0.6972233 0.08223667
C  -0.04335946 0.70357367 -0.08477235
C  1.15537967 1.44291378 -0.08480305
C  -1.18157184 -1.43449377 0.08195117
C  1.27177179 -1.31772051 0.24397497
C  -1.2989731 1.31930475 -0.24610559
C  2.35718511 0.83036001 0.07231049
C  -2.37900815 -0.81092981 -0.07612772
C  2.39022098 -0.55783925 0.2358138
C  -2.44072384 0.58230576 -0.24226816
F  3.57673592 -1.13089651 0.38724839
H  1.10786849 2.51402384 -0.21253532
H  -1.13491862 -2.50573807 0.20963762
H  1.34556706 -2.38610029 0.37327139
H  -1.33916911 2.39113215 -0.3733976
H  3.28384397 1.38136107 0.07466978
H  -3.29097258 -1.38785498 -0.07442616
H  -3.39810483 1.06382047 -0.36667826
