program: Gaussian 16
title: 1F_isomer_3 opt
version: ES64L-G16RevC.02
basis: CBSB1
frameworkgroup: C1[X(C10H7F)]
method: RHF
basis: STO-3G
operation: FOpt
keyword: #P
keyword: opt
keyword: EmpiricalDispersion=GD3BJ
keyword: integral(grid=ultrafinegrid)
keyword: GFInput
keyword: pop=full
keyword: IOP(3/74=-78)
keyword: IOP(6/7=3)
keyword: IOP(3/5=10)
keyword: IOP(3/175=01217700)
keyword: IOP(3/177=414500)
keyword: IOP(3/178=4859300)
keyword: SCF=YQC
title: #P opt EmpiricalDispersion=GD3BJ integral(grid=ultrafinegrid) GFInput
nucrepener: 550.1123806200
basis: NPDir=0 NMtPBC= 1 NCelOv= 1 NCel= 1 NClECP= 1 NCelD= 1
basis: NCelK= 1 NCelE2= 1 NClLst= 1 CellRange= 0.0.
basis: One-electron integrals computed using PRISM.
basis: One-electron integral symmetry used in STVInt
basis: NBasis= 416 RedAO= T EigKep= 1.53D-06 NBF= 416
basis: NBsUse= 414 1.00D-06 EigRej= 5.73D-07 NBFU= 414
converged: YES YES YES YES
title: Mulliken charges:
elementType: C C C C C C C C C C F H H H H H H H
charge: 0.522929 -0.121344 -0.534626 -0.039849 -0.246141 -0.271815 -0.036056 -0.019080 -0.026425 0.198078 -0.239203 0.092440 0.121925 0.099215 0.125563 0.115851 0.118173 0.140366
chargesum: 0.00000
charge: 0.445710 -0.095925 -0.578840 -0.038252 -0.242756 -0.244114 0.014473 0.019029 -0.013223 0.159421 -0.224509 0.089342 0.121879 0.094031 0.123245 0.113312 0.117199 0.139979
chargesum: -0.00000
dipole: -0.6008 1.2859 0.0000
dipole: 1.4193
quadrupole: -54.0923 -58.5251 -67.5181
quadrupole: 2.9898 -0.0000 -0.0000
quadrupole: 5.9529 1.5201 -7.4730 2.9898 -0.0000 -0.0000
hfenergy: -484.4687112 hartree
pointgroup: C01 [X(C10H7F1)]
dipole: 0.1246887 -0.5367151 0.0905072 debye
InChI: InChI=1/10C.F.7H
charge 0 multiplicity 1
18 atoms
C  -0.01011257 0.67950787 -0.11734115
C  0.01730891 -0.71136534 0.12271721
C  -1.19508515 -1.41337433 0.26674258
C  1.19470179 1.39061341 -0.26279859
C  1.2698576 -1.34862883 0.20958774
C  -1.26853745 1.29782763 -0.20082548
C  -2.38440259 -0.76317918 0.1764565
C  2.3849869 0.74055366 -0.1725539
C  2.42257044 -0.64298289 0.06604602
C  -2.43065146 0.6197302 -0.06187333
F  -1.29765256 2.60461675 -0.42630881
H  -1.16400875 -2.47659845 0.45006167
H  1.15683206 2.45220281 -0.44570822
H  1.29834667 -2.4124498 0.39305821
H  -3.3093199 -1.30707779 0.28777486
H  3.30766258 1.28842337 -0.28451738
H  3.37462042 -1.1461783 0.1353302
H  -3.36711894 1.14835919 -0.13584717
