program: Gaussian 16
title: 5F_isomer_56 opt
version: ES64L-G16RevC.02
basis: CBSB1
frameworkgroup: C1[X(C10H3F5)]
method: RHF
basis: STO-3G
operation: FOpt
keyword: #P
keyword: opt
keyword: EmpiricalDispersion=GD3BJ
keyword: integral(grid=ultrafinegrid)
keyword: GFInput
keyword: pop=full
keyword: IOP(3/74=-78)
keyword: IOP(6/7=3)
keyword: IOP(3/5=10)
keyword: IOP(3/175=01217700)
keyword: IOP(3/177=414500)
keyword: IOP(3/178=4859300)
keyword: SCF=YQC
title: #P opt EmpiricalDispersion=GD3BJ integral(grid=ultrafinegrid) GFInput
nucrepener: 969.8373547367
basis: NPDir=0 NMtPBC= 1 NCelOv= 1 NCel= 1 NClECP= 1 NCelD= 1
basis: NCelK= 1 NCelE2= 1 NClLst= 1 CellRange= 0.0.
basis: One-electron integrals computed using PRISM.
basis: One-electron integral symmetry used in STVInt
basis: NBasis= 528 RedAO= T EigKep= 1.36D-06 NBF= 528
basis: NBsUse= 526 1.00D-06 EigRej= 6.14D-07 NBFU= 526
converged: YES YES YES YES
title: Mulliken charges:
elementType: C C C C C C C C C C F F F F F H H H
charge: 0.014438 -0.158531 -0.218271 0.153952 -0.203089 0.167240 0.408609 -0.163512 0.393130 0.342297 -0.247110 -0.248725 -0.232882 -0.216939 -0.228701 0.145744 0.138299 0.154052
chargesum: 0.00000
charge: 0.035837 -0.134554 -0.200761 0.019592 -0.186276 0.172752 0.434999 -0.129095 0.391715 0.357914 -0.250723 -0.253933 -0.242610 -0.205011 -0.234182 0.142005 0.131733 0.150598
chargesum: -0.00000
dipole: -1.6110 1.0980 -0.0000
dipole: 1.9496
quadrupole: -87.5517 -80.9751 -80.6460
quadrupole: -3.8952 0.0000 -0.0000
quadrupole: -4.4941 2.0825 2.4116 -3.8952 0.0000 -0.0000
hfenergy: -881.0275239 hartree
pointgroup: C01 [X(C10H3F5)]
dipole: -0.7232837 -0.2459546 0.0685592 debye
InChI: InChI=1/10C.5F.3H
charge 0 multiplicity 1
18 atoms
C  0.06279265 0.69334532 -0.07854957
C  -0.09638921 -0.69882309 0.08109166
C  1.04586625 -1.51278894 0.10271777
C  -1.06913235 1.52585037 -0.10277793
C  1.35957859 1.21061828 -0.20971291
C  -1.39138678 -1.23122889 0.21378568
C  2.28700342 -0.98570282 -0.02627518
C  -2.2915789 0.96101585 0.029208
C  2.44469606 0.39902431 -0.18502683
C  -2.47642378 -0.41539427 0.18863663
F  0.90846881 -2.81442468 0.2513134
F  1.52590557 2.50912428 -0.35965009
F  3.35794916 -1.74193281 -0.00674726
F  -3.36945303 1.72601077 0.00913546
F  3.65679943 0.8807038 -0.3074283
H  -0.96731467 2.59103875 -0.22376454
H  -1.50945085 -2.29527367 0.33559207
H  -3.47793039 -0.80116357 0.28845192
