program: Gaussian 16
title: 2F_isomer_5 opt
version: ES64L-G16RevA.03
basis: CBSB1
frameworkgroup: CS[SG(C6H4F2)]
method: RHF
basis: STO-3G
operation: FOpt
keyword: #Popt
keyword: EmpiricalDispersion=GD3BJ
keyword: integral(grid=ultrafinegrid)
keyword: GFInput
keyword: pop=full
keyword: IOP(3/74=-78)
keyword: IOP(6/7=3)
keyword: IOP(3/5=10)
keyword: IOP(3/175=01217700)
keyword: IOP(3/177=414500)
keyword: IOP(3/178=4859300)
keyword: SCF=YQC
title: #P opt EmpiricalDispersion=GD3BJ integral(grid=ultrafinegrid) GFInput
nucrepener: 339.2500807620
basis: NPDir=0 NMtPBC= 1 NCelOv= 1 NCel= 1 NClECP= 1 NCelD= 1
basis: NCelK= 1 NCelE2= 1 NClLst= 1 CellRange= 0.0.
basis: One-electron integrals computed using PRISM.
basis: One-electron integral symmetry used in STVInt
basis: NBasis= 296 RedAO= T EigKep= 2.35D-06 NBF= 204 92
basis: NBsUse= 296 1.00D-06 EigRej= -1.00D+00 NBFU= 204 92
converged: YES YES YES YES
title: Mulliken charges:
elementType: F C C C C F C C H H H H
charge: -0.215319 -0.748071 0.317935 0.318070 -0.748076 -0.215319 0.317939 0.318065 0.163707 0.163681 0.163707 0.163681
chargesum: -0.00000
charge: -0.205229 -0.761335 0.320990 0.320989 -0.761335 -0.205229 0.320990 0.320989 0.162292 0.162292 0.162292 0.162292
dipole: -0.0000 0.0000 0.0000
dipole: 0.0000
quadrupole: -36.4804 -51.5238 -46.5730
quadrupole: 0.0000 0.0000 0.0000
quadrupole: 8.3787 -6.6648 -1.7139 0.0000 0.0000 0.0000
hfenergy: -430.1903338 hartree
pointgroup: CS [SG(C6H4F2)]
dipole: 0. 0. 0. debye
InChI: InChI=1/6C.2F.4H
charge 0 multiplicity 1
12 atoms
F  2.6293722 -0.53580563 0.0000
C  1.32943652 -0.27090879 0.0000
C  0.91623588 1.03974549 0.0000
C  -0.4363173 1.31536548 0.0000
C  -1.32943668 0.27090913 0.0000
F  -2.62937236 0.53580595 0.0000
C  -0.91623604 -1.03974516 0.0000
C  0.43631712 -1.31536515 0.0000
H  1.64834184 1.83086129 0.0000
H  -0.80047685 2.32987547 0.0000
H  -1.64834201 -1.83086095 0.0000
H  0.80047669 -2.32987514 0.0000
