program: Gaussian 16
title: 3F_isomer_8 opt
version: ES64L-G16RevA.03
basis: CBSB1
frameworkgroup: CS[SG(C6H3F3)]
method: RHF
basis: STO-3G
operation: FOpt
keyword: #Popt
keyword: EmpiricalDispersion=GD3BJ
keyword: integral(grid=ultrafinegrid)
keyword: GFInput
keyword: pop=full
keyword: IOP(3/74=-78)
keyword: IOP(6/7=3)
keyword: IOP(3/5=10)
keyword: IOP(3/175=01217700)
keyword: IOP(3/177=414500)
keyword: IOP(3/178=4859300)
keyword: SCF=YQC
title: #P opt EmpiricalDispersion=GD3BJ integral(grid=ultrafinegrid) GFInput
nucrepener: 419.5118487364
basis: NPDir=0 NMtPBC= 1 NCelOv= 1 NCel= 1 NClECP= 1 NCelD= 1
basis: NCelK= 1 NCelE2= 1 NClLst= 1 CellRange= 0.0.
basis: One-electron integrals computed using PRISM.
basis: One-electron integral symmetry used in STVInt
basis: NBasis= 324 RedAO= T EigKep= 2.95D-06 NBF= 222 102
basis: NBsUse= 324 1.00D-06 EigRej= -1.00D+00 NBFU= 222 102
converged: YES YES YES YES
title: Mulliken charges:
elementType: F C C C F C C F C H H H
charge: -0.206005 -1.253765 1.260489 -1.253378 -0.202145 1.267169 -1.253284 -0.200821 1.262242 0.192496 0.194096 0.192907
chargesum: -0.00000
charge: -0.187815 -1.086349 1.077812 -1.086034 -0.187730 1.078400 -1.085934 -0.187701 1.077964 0.195805 0.195782 0.195799
dipole: -0.0004 -0.0017 0.0000
dipole: 0.0018
quadrupole: -49.9885 -49.9984 -49.9707
quadrupole: 0.0013 0.0000 -0.0000
quadrupole: -0.0027 -0.0125 0.0152 0.0013 0.0000 -0.0000
hfenergy: -529.3361391 hartree
pointgroup: CS [SG(C6H3F3)]
dipole: -0.0006997 0.000026 0. debye
InChI: InChI=1/6C.3F.3H
charge 0 multiplicity 1
12 atoms
F  2.56282329 -0.76022207 0.0000
C  1.29727242 -0.38478361 0.0000
C  1.01278058 0.96035827 0.0000
C  -0.3155113 1.3160701 0.0000
F  -0.62343275 2.59949323 0.0000
C  -1.33791696 0.39683649 0.0000
C  -0.98211264 -0.93127265 0.0000
F  -1.9399028 -1.83924754 0.0000
C  0.3253663 -1.35720619 0.0000
H  1.79406831 1.70100994 0.0000
H  -2.36996002 0.70300234 0.0000
H  0.57652558 -2.40403932 0.0000
