program: Gaussian 16
title: Cl0F_isomer_1 opt
version: ES64L-G16RevA.03
basis: CBSB1
frameworkgroup: C2[C2(Cl),X(C6H6)]
method: RHF
basis: STO-3G
operation: FOpt
keyword: #P
keyword: opt
keyword: EmpiricalDispersion=GD3BJ
keyword: integral(grid=ultrafinegrid)
keyword: GFInput
keyword: pop=full
keyword: IOP(3/74=-78)
keyword: IOP(6/7=3)
keyword: IOP(3/5=10)
keyword: IOP(3/175=01217700)
keyword: IOP(3/177=414500)
keyword: IOP(3/178=4859300)
keyword: SCF=YQC
title: #P opt EmpiricalDispersion=GD3BJ integral(grid=ultrafinegrid) GFInput
nucrepener: 382.8631954143
basis: NPDir=0 NMtPBC= 1 NCelOv= 1 NCel= 1 NClECP= 1 NCelD= 1
basis: NCelK= 1 NCelE2= 1 NClLst= 1 CellRange= 0.0.
basis: One-electron integrals computed using PRISM.
basis: One-electron integral symmetry used in STVInt
basis: NBasis= 294 RedAO= T EigKep= 1.28D-05 NBF= 148 146
basis: NBsUse= 293 1.00D-06 EigRej= 9.58D-07 NBFU= 148 145
converged: YES YES YES YES
title: Mulliken charges:
elementType: C C C C C C H H H H H H Cl
charge: -0.040225 -0.040239 -0.040221 -0.040225 -0.040239 -0.040221 0.012589 0.012583 0.012588 0.012589 0.012583 0.012588 -0.834150
chargesum: -1.00000
charge: -0.100783 -0.100856 -0.100862 -0.100783 -0.100856 -0.100862 0.098920 0.098917 0.098916 0.098920 0.098917 0.098916 -0.988504
dipole: -0.0000 -0.0000 -11.8452
dipole: 11.8452
quadrupole: -49.7251 -49.7253 -98.4706
quadrupole: 0.0000 -0.0000 0.0000
quadrupole: 16.2485 16.2484 -32.4969 0.0000 -0.0000 0.0000
hfenergy: -691.9795495 hartree
pointgroup: C02 [C2(Cl1),X(C6H6)]
dipole: 0. 0. -4.6602586 debye
InChI: InChI=1/6C.Cl.6H
charge -1 multiplicity 1
13 atoms
C  -1.19472607 0.68977525 -0.20566372
C  0.00000381 1.37956434 -0.20567661
C  1.19473464 0.68978645 -0.20567804
C  1.19472607 -0.68977525 -0.20566372
C  -0.00000381 -1.37956434 -0.20567661
C  -1.19473464 -0.68978645 -0.20567804
H  -2.12882451 1.22907758 -0.16648505
H  -0.00000338 2.4581689 -0.16650345
H  2.12883623 1.22908374 -0.16650704
H  2.12882451 -1.22907758 -0.16648505
H  0.00000338 -2.4581689 -0.16650345
H  -2.12883623 -1.22908374 -0.16650704
Cl 0.0000 0.0000 3.73302782
