program: Gaussian 16
title: Cl3F_isomer_6 opt
version: ES64L-G16RevA.03
basis: CBSB1
frameworkgroup: C1[X(C6H3ClF3)]
method: RHF
basis: STO-3G
operation: FOpt
keyword: #P
keyword: opt
keyword: EmpiricalDispersion=GD3BJ
keyword: integral(grid=ultrafinegrid)
keyword: GFInput
keyword: pop=full
keyword: IOP(3/74=-78)
keyword: IOP(6/7=3)
keyword: IOP(3/5=10)
keyword: IOP(3/175=01217700)IOP(3/177=414500)
keyword: IOP(3/178=4859300)
keyword: SCF=YQC
title: #P opt EmpiricalDispersion=GD3BJ integral(grid=ultrafinegrid) GFInput
nucrepener: 652.3324149134
basis: NPDir=0 NMtPBC= 1 NCelOv= 1 NCel= 1 NClECP= 1 NCelD= 1
basis: NCelK= 1 NCelE2= 1 NClLst= 1 CellRange= 0.0.
basis: One-electron integrals computed using PRISM.
basis: One-electron integral symmetry used in STVInt
basis: NBasis= 378 RedAO= T EigKep= 1.58D-06 NBF= 378
basis: NBsUse= 378 1.00D-06 EigRej= -1.00D+00 NBFU= 378
converged: YES YES YES YES
title: Mulliken charges:
elementType: F C C C C C F C F H H H Cl
charge: -0.272292 -0.349351 0.491495 -0.469869 0.491494 -0.349352 -0.272292 0.755847 -0.312325 0.109393 0.079039 0.109393 -1.011180
chargesum: -1.00000
charge: -0.233608 -0.340022 0.194075 -0.039460 0.194077 -0.340022 -0.233608 0.670356 -0.289841 0.169589 0.048616 0.169589 -0.969740
dipole: -14.4129 -0.0000 0.0001
dipole: 14.4129
quadrupole: -155.0726 -69.0888 -66.8671
quadrupole: 0.0000 0.0001 0.0000
quadrupole: -58.0631 27.9207 30.1424 0.0000 0.0001 0.0000
hfenergy: -989.4296114 hartree
pointgroup: C01 [X(C6H3Cl1F3)]
dipole: 4.7263702 -0.0000018 -3.133001 debye
InChI: InChI=1/6C.Cl.3F.3H
charge -1 multiplicity 1
13 atoms
F  0.79326162 2.31763581 -0.78460136
C  0.21714323 1.18463395 -0.40269501
C  -0.92675005 1.19623008 0.35556133
C  -1.50349625 0.00000196 0.7378885
C  -0.92675205 -1.19622744 0.35556229
C  0.2171412 -1.18463399 -0.40269403
F  0.79325759 -2.31763721 -0.7845994
C  0.80225472 -0.00000069 -0.79057225
F  1.90579493 -0.00000192 -1.52202778
H  -1.36368465 2.13848075 0.64530487
H  -2.41295137 0.00000206 1.34075863
H  -1.36368847 -2.13847696 0.64530677
Cl -4.32283194 0.00000226 2.60680744
