program: Gaussian 16
title: Cl3F_isomer_8 opt
version: ES64L-G16RevA.03
basis: CBSB1
frameworkgroup: C1[X(C6H3ClF3)]
method: RHF
basis: STO-3G
operation: FOpt
keyword: #P
keyword: opt
keyword: EmpiricalDispersion=GD3BJ
keyword: integral(grid=ultrafinegrid)
keyword: GFInput
keyword: pop=full
keyword: IOP(3/74=-78)
keyword: IOP(6/7=3)
keyword: IOP(3/5=10)
keyword: IOP(3/175=01217700)IOP(3/177=414500)
keyword: IOP(3/178=4859300)
keyword: SCF=YQC
title: #P opt EmpiricalDispersion=GD3BJ integral(grid=ultrafinegrid) GFInput
nucrepener: 642.8434799126
basis: NPDir=0 NMtPBC= 1 NCelOv= 1 NCel= 1 NClECP= 1 NCelD= 1
basis: NCelK= 1 NCelE2= 1 NClLst= 1 CellRange= 0.0.
basis: One-electron integrals computed using PRISM.
basis: One-electron integral symmetry used in STVInt
basis: NBasis= 378 RedAO= T EigKep= 2.40D-06 NBF= 378
basis: NBsUse= 378 1.00D-06 EigRej= -1.00D+00 NBFU= 378
converged: YES YES YES YES
title: Mulliken charges:
elementType: F C C C F C C F C H H H Cl
charge: -0.254828 -1.031877 1.164387 -1.031290 -0.254768 1.164727 -1.031123 -0.254748 1.164551 0.130741 0.130700 0.130731 -1.027202
chargesum: -1.00000
charge: -0.217744 -1.337724 1.275463 -0.892693 -0.192589 1.275536 -1.337766 -0.217741 1.097998 0.186024 0.186027 0.168586 -0.993377
dipole: 9.9649 -0.0000 -5.4233
dipole: 11.3452
quadrupole: -99.1743 -69.1968 -76.1965
quadrupole: 0.0000 15.0971 0.0000
quadrupole: -17.6517 12.3258 5.3260 0.0000 15.0971 0.0000
hfenergy: -989.4274036 hartree
pointgroup: C01 [X(C6H3Cl1F3)]
dipole: -1.0649736 0.6150924 -4.2907539 debye
InChI: InChI=1/6C.Cl.3F.3H
charge -1 multiplicity 1
13 atoms
F  -0.0682403 2.71731454 -0.24060318
C  -0.0663886 1.3890237 -0.18161036
C  1.13261614 0.73948087 -0.05103261
C  1.09525801 -0.63224533 0.02042471
F  2.23179131 -1.28841131 0.12742788
C  -0.07400612 -1.35047554 -0.0509939
C  -1.23603708 -0.63689374 -0.18157377
F  -2.38729109 -1.29944661 -0.24052754
C  -1.27248651 0.73475228 -0.25474617
H  2.05727323 1.27690704 0.06070946
H  -0.07709068 -2.41996063 0.06078868
H  -2.20154066 1.27113314 -0.33906133
Cl 0.86636133 -0.50029772 3.27079813
