program: Gaussian 16
title: Cl4F_isomer_9 opt
version: ES64L-G16RevA.03
basis: CBSB1
frameworkgroup: C1[X(C6H2ClF4)]
method: RHF
basis: STO-3G
operation: FOpt
keyword: #P
keyword: opt
keyword: EmpiricalDispersion=GD3BJ
keyword: integral(grid=ultrafinegrid)
keyword: GFInput
keyword: pop=full
keyword: IOP(3/74=-78)
keyword: IOP(6/7=3)
keyword: IOP(3/5=10)
keyword: IOP(3/175=01217700)IOP(3/177=414500)
keyword: IOP(3/178=4859300)
keyword: SCF=YQC
title: #P opt EmpiricalDispersion=GD3BJ integral(grid=ultrafinegrid) GFInput
nucrepener: 713.7758224968
basis: NPDir=0 NMtPBC= 1 NCelOv= 1 NCel= 1 NClECP= 1 NCelD= 1
basis: NCelK= 1 NCelE2= 1 NClLst= 1 CellRange= 0.0.
basis: One-electron integrals computed using PRISM.
basis: One-electron integral symmetry used in STVInt
basis: NBasis= 406 RedAO= T EigKep= 1.61D-06 NBF= 406
basis: NBsUse= 406 1.00D-06 EigRej= -1.00D+00 NBFU= 406
converged: YES YES YES YES
title: Mulliken charges:
elementType: F C C C C F C F C F H H Cl
charge: -0.245069 -0.239781 0.258152 0.258170 -0.239797 -0.245069 0.323303 -0.265577 0.323294 -0.265575 0.141530 0.141531 -0.945112
chargesum: -1.00000
charge: -0.237703 -0.573344 0.586419 0.586033 -0.572377 -0.237706 0.330069 -0.278692 0.330454 -0.278695 0.152273 0.152326 -0.959056
dipole: 13.5302 -0.0004 -0.0002
dipole: 13.5302
quadrupole: -147.1929 -79.3841 -70.1684
quadrupole: 0.0026 0.0005 0.0000
quadrupole: -48.2777 19.5311 28.7467 0.0026 0.0005 0.0000
hfenergy: -1088.5705472 hartree
pointgroup: C01 [X(C6H2Cl1F4)]
dipole: -3.185295 -3.246376 -2.7661105 debye
InChI: InChI=1/6C.Cl.4F.2H
charge -1 multiplicity 1
13 atoms
F  2.0931697 -1.71905481 -0.04211478
C  1.1532977 -0.78633674 0.0249383
C  1.37295865 0.4032487 0.66689864
C  0.36685734 1.34940148 0.71423706
C  -0.83792792 1.0862156 0.11864919
F  -1.82768063 1.96804979 0.14239979
C  -1.06071516 -0.11132784 -0.52822496
F  -2.22370471 -0.36482695 -1.10289237
C  -0.05945017 -1.05290786 -0.575377
F  -0.27092062 -2.20119955 -1.19483461
H  2.31047723 0.64853513 1.14929093
H  0.57905475 2.27673815 1.23075885
Cl 2.83433935 2.87803456 2.39627096
