program: Gaussian 16
title: Cl5F_isomer_12 opt
version: ES64L-G16RevA.03
basis: CBSB1
frameworkgroup: C1[X(C6HClF5)]
method: RHF
basis: STO-3G
operation: FOpt
keyword: #P
keyword: opt
keyword: EmpiricalDispersion=GD3BJ
keyword: integral(grid=ultrafinegrid)
keyword: GFInput
keyword: pop=full
keyword: IOP(3/74=-78)
keyword: IOP(6/7=3)
keyword: IOP(3/5=10)
keyword: IOP(3/175=01217700)IOP(3/177=414500)
keyword: IOP(3/178=4859300)
keyword: SCF=YQC
title: #P opt EmpiricalDispersion=GD3BJ integral(grid=ultrafinegrid) GFInput
nucrepener: 887.7628828333
basis: NPDir=0 NMtPBC= 1 NCelOv= 1 NCel= 1 NClECP= 1 NCelD= 1
basis: NCelK= 1 NCelE2= 1 NClLst= 1 CellRange= 0.0.
basis: One-electron integrals computed using PRISM.
basis: One-electron integral symmetry used in STVInt
basis: NBasis= 434 RedAO= T EigKep= 1.51D-06 NBF= 434
basis: NBsUse= 434 1.00D-06 EigRej= -1.00D+00 NBFU= 434
converged: YES YES YES YES
title: Mulliken charges:
elementType: F C C C F C F C F C F H Cl
charge: -0.272868 -0.418624 0.950117 -0.418620 -0.272869 0.615700 -0.310126 -0.012481 -0.289097 0.615705 -0.310128 0.147059 -1.023768
chargesum: -1.00000
charge: -0.230123 -0.533735 1.048677 -0.533652 -0.230076 0.540024 -0.270239 -0.038174 -0.247604 0.539975 -0.270174 0.184478 -0.959377
dipole: -0.0014 4.4979 -9.8167
dipole: 10.7981
quadrupole: -85.3160 -86.0166 -99.4133
quadrupole: 0.0016 -0.0033 14.2383
quadrupole: 4.9326 4.2320 -9.1647 0.0016 -0.0033 14.2383
hfenergy: -1187.6960106 hartree
pointgroup: C01 [X(C6H1Cl1F5)]
dipole: -0.0617906 0.1079667 -4.2464853 debye
InChI: InChI=1/6C.Cl.5F.H
charge -1 multiplicity 1
13 atoms
F  -2.33304408 1.59897479 -0.07423934
C  -1.18200156 0.95148268 -0.09288288
C  -0.00330498 1.64903427 -0.12130896
C  1.1750009 0.95024426 -0.12709257
F  2.32676687 1.59651936 -0.14151296
C  1.18870874 -0.42244039 -0.11204708
F  2.32526275 -1.08747963 -0.11356227
C  -0.00414169 -1.10460842 -0.08368988
F  -0.00446927 -2.41855859 -0.06127453
C  -1.1966144 -0.42117677 -0.07705318
F  -2.33339452 -1.0850271 -0.04470882
H  -0.00215673 2.7242135 -0.08023576
Cl 0.04337432 0.30619802 3.12960823
