program: Gaussian 16
title: Cl6F_isomer_13 opt
version: ES64L-G16RevA.03
basis: CBSB1
frameworkgroup: C2[C2(Cl),X(C6F6)]
method: RHF
basis: STO-3G
operation: FOpt
keyword: #P
keyword: opt
keyword: EmpiricalDispersion=GD3BJ
keyword: integral(grid=ultrafinegrid)
keyword: GFInput
keyword: pop=full
keyword: IOP(3/74=-78)
keyword: IOP(6/7=3)
keyword: IOP(3/5=10)
keyword: IOP(3/175=01217700)
keyword: IOP(3/177=414500)
keyword: IOP(3/178=4859300)
keyword: SCF=YQC
title: #P opt EmpiricalDispersion=GD3BJ integral(grid=ultrafinegrid) GFInput
nucrepener: 1021.2248386128
basis: NPDir=0 NMtPBC= 1 NCelOv= 1 NCel= 1 NClECP= 1 NCelD= 1
basis: NCelK= 1 NCelE2= 1 NClLst= 1 CellRange= 0.0.
basis: One-electron integrals computed using PRISM.
basis: One-electron integral symmetry used in STVInt
basis: NBasis= 462 RedAO= T EigKep= 1.12D-06 NBF= 232 230
basis: NBsUse= 462 1.00D-06 EigRej= -1.00D+00 NBFU= 232 230
converged: YES YES YES YES
title: Mulliken charges:
elementType: F C C F C F C F C F C F Cl
charge: -0.302040 0.306141 0.306136 -0.302037 0.306049 -0.302041 0.306141 -0.302040 0.306136 -0.302037 0.306049 -0.302041 -1.024417
chargesum: -1.00000
charge: -0.260476 0.251749 0.252296 -0.260535 0.252478 -0.260572 0.251749 -0.260476 0.252296 -0.260535 0.252478 -0.260572 -0.949881
dipole: 0.0000 0.0000 -10.7165
dipole: 10.7165
quadrupole: -87.6526 -87.6473 -110.6899
quadrupole: 0.0017 -0.0000 -0.0000
quadrupole: 7.6773 7.6827 -15.3600 0.0017 -0.0000 -0.0000
hfenergy: -1286.8293057 hartree
pointgroup: C02 [C2(Cl1),X(C6F6)]
dipole: 0. 0. -4.2162101 debye
InChI: InChI=1/6C.Cl.6F
charge -1 multiplicity 1
13 atoms
F  2.32698551 1.34601367 -0.0824219
C  1.18883985 0.68766591 -0.09396815
C  1.18992796 -0.68566748 -0.09393689
F  2.32911941 -1.34226335 -0.08294449
C  0.00113849 -1.37326004 -0.09408368
F  0.00235167 -2.68820251 -0.08371006
C  -1.18883985 -0.68766591 -0.09396815
F  -2.32698551 -1.34601367 -0.0824219
C  -1.18992796 0.68566748 -0.09393689
F  -2.32911941 1.34226335 -0.08294449
C  -0.00113849 1.37326004 -0.09408368
F  -0.00235167 2.68820251 -0.08371006
Cl 0.0000 0.0000 3.08395492
